Regexp-Compare v0.33 Perl 5 v5.38.2 MSWin32-x86-multi-thread-64int

Status
Unknown
From
gregor herrmann
Dist
Regexp-Compare v0.33
Platform
Perl 5 v5.38.2 MSWin32-x86-multi-thread-64int
Date
2024-05-08T20:05:39
ID
df6a1e7a-6ce8-1014-87b8-df335915f699
This distribution has been tested as part of the CPAN Testers
project, supporting the Perl programming language.  See
http://wiki.cpantesters.org/ for more information or email
questions to cpan-testers-discuss@perl.org


--
Dear Vaclav Barta,

This is a computer-generated report for Regexp-Compare-0.33
on perl 5.38.2, created by CPAN-Reporter-1.2019.

Thank you for uploading your work to CPAN.  However, attempting to
test your distribution gave an inconclusive result.

This could be because your distribution had an error during the make/build
stage, did not define tests, tests could not be found, because your tests were
interrupted before they finished, or because the results of the tests could not
be parsed.  You may wish to consult the CPAN Testers Wiki:

http://wiki.cpantesters.org/wiki/CPANAuthorNotes

Sections of this report:

    * Tester comments
    * Program output
    * Prerequisites
    * Environment and other context

------------------------------
TESTER COMMENTS
------------------------------

Additional comments from tester:

this report is from an automated smoke testing program
and was not reviewed by a human for accuracy

------------------------------
PROGRAM OUTPUT
------------------------------

Output from 'C:\strawberry\c\bin\gmake.EXE':

cp lib/Regexp/Compare.pm blib\lib\Regexp\Compare.pm
Running Mkbootstrap for Compare ()
"C:\Strawberry\perl\bin\perl.exe" -MExtUtils::Command -e chmod -- 644 "Compare.bs"
"C:\Strawberry\perl\bin\perl.exe" -MExtUtils::Command::MM -e cp_nonempty -- Compare.bs blib\arch\auto\Regexp\Compare\Compare.bs 644
"C:\Strawberry\perl\bin\perl.exe" "C:\Strawberry\perl\lib\ExtUtils/xsubpp"  -typemap C:\strawberry\perl\lib\ExtUtils\typemap  Compare.xs > Compare.xsc
"C:\Strawberry\perl\bin\perl.exe" -MExtUtils::Command -e mv -- Compare.xsc Compare.c
gcc -c  -I. -DWIN32 -DPERL_TEXTMODE_SCRIPTS -DMULTIPLICITY -DPERL_IMPLICIT_SYS -DUSE_PERLIO -D__USE_MINGW_ANSI_STDIO -fwrapv -fno-strict-aliasing -mms-bitfields -Os -falign-functions -falign-jumps -falign-labels -falign-loops -freorder-blocks -freorder-blocks-algorithm=stc -freorder-blocks-and-partition   -DVERSION=\"0.33\" -DXS_VERSION=\"0.33\"  "-IC:\strawberry\perl\lib\CORE"   Compare.c
gcc -c  -I. -DWIN32 -DPERL_TEXTMODE_SCRIPTS -DMULTIPLICITY -DPERL_IMPLICIT_SYS -DUSE_PERLIO -D__USE_MINGW_ANSI_STDIO -fwrapv -fno-strict-aliasing -mms-bitfields -Os -falign-functions -falign-jumps -falign-labels -falign-loops -freorder-blocks -freorder-blocks-algorithm=stc -freorder-blocks-and-partition   -DVERSION=\"0.33\" -DXS_VERSION=\"0.33\"  "-IC:\strawberry\perl\lib\CORE"   engine.c
engine.c:22:2: error: #error Unsupported PERL_API_VERSION
 #error Unsupported PERL_API_VERSION
  ^~~~~
engine.c:164:44: error: '_CC_VERTSPACE' undeclared here (not in a function); did you mean 'CC_VERTSPACE_'?
 static unsigned char word_posix_regclasses[_CC_VERTSPACE + 1];
                                            ^~~~~~~~~~~~~
                                            CC_VERTSPACE_
engine.c: In function 'convert_invlist_to_map':
engine.c:488:2: error: #error unexpected PERL_API_VERSION
 #error unexpected PERL_API_VERSION
  ^~~~~
engine.c: In function 'convert_regclass_map':
engine.c:760:9: warning: implicit declaration of function 'ARG_LOC'; did you mean 'ARG1a_LOC'? [-Wimplicit-function-declaration]
     n = ARG_LOC(a->rn);
         ^~~~~~~
         ARG1a_LOC
engine.c:783:29: error: 'regnode' {aka 'struct regnode'} has no member named 'flags'
                     !!(a->rn->flags & ANYOF_INVERT),
                             ^~
engine.c: In function 'get_invlist_sv':
engine.c:807:23: warning: implicit declaration of function 'ARG'; did you mean 'ARGp'? [-Wimplicit-function-declaration]
         const U32 n = ARG(a->rn);
                       ^~~
                       ARGp
engine.c: In function 'convert_map':
engine.c:831:31: error: 'ANYOF_SHARED_d_UPPER_LATIN1_UTF8_STRING_MATCHES_non_d_RUNTIME_USER_PROP' undeclared (first use in this function)
     if (ANYOF_FLAGS(a->rn) & (ANYOF_SHARED_d_UPPER_LATIN1_UTF8_STRING_MATCHES_non_d_RUNTIME_USER_PROP | ANYOF_INVERT))
                               ^~~~~~~~~~~~~~~~~~~~~~~~~~~~~~~~~~~~~~~~~~~~~~~~~~~~~~~~~~~~~~~~~~~~~~~
engine.c:831:31: note: each undeclared identifier is reported only once for each function it appears in
engine.c: In function 'convert_class_narrow':
engine.c:850:14: error: 'regnode' {aka 'struct regnode'} has no member named 'flags'
     if (a->rn->flags >= SIZEOF_ARRAY(posix_regclass_blocks))
              ^~
engine.c:856:43: error: 'regnode' {aka 'struct regnode'} has no member named 'flags'
     U32 mask = posix_regclass_blocks[a->rn->flags];
                                           ^~
engine.c: In function 'get_synth_offset':
engine.c:968:12: error: 'regnode' {aka 'struct regnode'} has no member named 'type'
     if (((p->type == EXACT) || (p->type == EXACTF) || (p->type == EXACTFU)) &&
            ^~
engine.c:968:34: error: 'regnode' {aka 'struct regnode'} has no member named 'type'
     if (((p->type == EXACT) || (p->type == EXACTF) || (p->type == EXACTFU)) &&
                                  ^~
engine.c:968:57: error: 'regnode' {aka 'struct regnode'} has no member named 'type'
     if (((p->type == EXACT) || (p->type == EXACTF) || (p->type == EXACTFU)) &&
                                                         ^~
engine.c:969:11: error: 'regnode' {aka 'struct regnode'} has no member named 'flags'
         (p->flags == 1))
           ^~
engine.c:973:29: error: 'regnode' {aka 'struct regnode'} has no member named 'type'
     else if (trivial_nodes[p->type] ||
                             ^~
engine.c:974:16: error: 'regnode' {aka 'struct regnode'} has no member named 'type'
              (p->type == REG_ANY) || (p->type == SANY) ||
                ^~
engine.c:974:40: error: 'regnode' {aka 'struct regnode'} has no member named 'type'
              (p->type == REG_ANY) || (p->type == SANY) ||
                                        ^~
engine.c:975:16: error: 'regnode' {aka 'struct regnode'} has no member named 'type'
              (p->type == POSIXD) || (p->type == NPOSIXD) ||
                ^~
engine.c:975:39: error: 'regnode' {aka 'struct regnode'} has no member named 'type'
              (p->type == POSIXD) || (p->type == NPOSIXD) ||
                                       ^~
engine.c:976:16: error: 'regnode' {aka 'struct regnode'} has no member named 'type'
              (p->type == POSIXU) || (p->type == NPOSIXU) ||
                ^~
engine.c:976:39: error: 'regnode' {aka 'struct regnode'} has no member named 'type'
              (p->type == POSIXU) || (p->type == NPOSIXU) ||
                                       ^~
engine.c:977:16: error: 'regnode' {aka 'struct regnode'} has no member named 'type'
              (p->type == POSIXA) || (p->type == NPOSIXA) ||
                ^~
engine.c:977:39: error: 'regnode' {aka 'struct regnode'} has no member named 'type'
              (p->type == POSIXA) || (p->type == NPOSIXA) ||
                                       ^~
engine.c:978:16: error: 'regnode' {aka 'struct regnode'} has no member named 'type'
              (p->type == LNBREAK))
                ^~
engine.c:982:16: error: 'regnode' {aka 'struct regnode'} has no member named 'type'
     else if ((p->type == ANYOF) || (p->type == ANYOFD))
                ^~
engine.c:982:38: error: 'regnode' {aka 'struct regnode'} has no member named 'type'
     else if ((p->type == ANYOF) || (p->type == ANYOFD))
                                      ^~
engine.c:986:33: error: 'regnode' {aka 'struct regnode'} has no member named 'flags'
         unsigned int unknown = p->flags & ~(ANYOF_INVERT |
                                 ^~
engine.c:987:13: error: 'ANYOF_MATCHES_ALL_ABOVE_BITMAP' undeclared (first use in this function); did you mean 'ANYOF_MATCHES_ALL_OUTSIDE_BITMAP'?
             ANYOF_MATCHES_ALL_ABOVE_BITMAP | ANYOF_SHARED_d_UPPER_LATIN1_UTF8_STRING_MATCHES_non_d_RUNTIME_USER_PROP | ANYOF_SHARED_d_UPPER_LATIN1_UTF8_STRING_MATCHES_non_d_RUNTIME_USER_PROP);
             ^~~~~~~~~~~~~~~~~~~~~~~~~~~~~~
             ANYOF_MATCHES_ALL_OUTSIDE_BITMAP
engine.c:987:46: error: 'ANYOF_SHARED_d_UPPER_LATIN1_UTF8_STRING_MATCHES_non_d_RUNTIME_USER_PROP' undeclared (first use in this function)
             ANYOF_MATCHES_ALL_ABOVE_BITMAP | ANYOF_SHARED_d_UPPER_LATIN1_UTF8_STRING_MATCHES_non_d_RUNTIME_USER_PROP | ANYOF_SHARED_d_UPPER_LATIN1_UTF8_STRING_MATCHES_non_d_RUNTIME_USER_PROP);
                                              ^~~~~~~~~~~~~~~~~~~~~~~~~~~~~~~~~~~~~~~~~~~~~~~~~~~~~~~~~~~~~~~~~~~~~~~
engine.c:1005:15: error: 'regnode' {aka 'struct regnode'} has no member named 'type'
     else if (p->type == ANYOFM)
               ^~
engine.c:1009:15: error: 'regnode' {aka 'struct regnode'} has no member named 'type'
     else if (p->type == NANYOFM)
               ^~
engine.c:1013:16: error: 'regnode' {aka 'struct regnode'} has no member named 'type'
     else if ((p->type == IFMATCH) || (p->type == UNLESSM) ||
                ^~
engine.c:1013:40: error: 'regnode' {aka 'struct regnode'} has no member named 'type'
     else if ((p->type == IFMATCH) || (p->type == UNLESSM) ||
                                        ^~
engine.c:1014:11: error: 'regnode' {aka 'struct regnode'} has no member named 'type'
         (p->type == SUSPEND))
           ^~
engine.c: In function 'get_size':
engine.c:1029:13: error: 'regnode' {aka 'struct regnode'} has no member named 'type'
     while (e->type != END)
             ^~
engine.c:78:29: error: 'regnode' {aka 'struct regnode'} has no member named 'next_off'
 #define GET_OFFSET(rn) ((rn)->next_off ? (rn)->next_off : get_synth_offset(rn))
                             ^~
engine.c:78:29: note: in definition of macro 'GET_OFFSET'
 #define GET_OFFSET(rn) ((rn)->next_off ? (rn)->next_off : get_synth_offset(rn))
                             ^~
engine.c:78:46: error: 'regnode' {aka 'struct regnode'} has no member named 'next_off'
 #define GET_OFFSET(rn) ((rn)->next_off ? (rn)->next_off : get_synth_offset(rn))
                                              ^~
engine.c:78:46: note: in definition of macro 'GET_OFFSET'
 #define GET_OFFSET(rn) ((rn)->next_off ? (rn)->next_off : get_synth_offset(rn))
                                              ^~
engine.c: In function 'find_internal':
engine.c:1080:13: error: 'regnode' {aka 'struct regnode'} has no member named 'flags'
     if (!((p->flags == REG_MAGIC) &&
             ^~
engine.c:1081:11: error: 'regnode' {aka 'struct regnode'} has no member named 'next_off'
         (p->next_off == 0)))
           ^~
engine.c: In function 'alloc_terminated':
engine.c:1261:23: error: 'regnode' {aka 'struct regnode'} has no member named 'type'
     last = alt[sz - 1].type;
                       ^
engine.c:1269:16: error: 'regnode' {aka 'struct regnode'} has no member named 'type'
     alt[sz - 1].type = END;
                ^
engine.c: In function 'bump_exact':
engine.c:78:29: error: 'regnode' {aka 'struct regnode'} has no member named 'next_off'
 #define GET_OFFSET(rn) ((rn)->next_off ? (rn)->next_off : get_synth_offset(rn))
                             ^~
engine.c:78:29: note: in definition of macro 'GET_OFFSET'
 #define GET_OFFSET(rn) ((rn)->next_off ? (rn)->next_off : get_synth_offset(rn))
                             ^~
engine.c:78:46: error: 'regnode' {aka 'struct regnode'} has no member named 'next_off'
 #define GET_OFFSET(rn) ((rn)->next_off ? (rn)->next_off : get_synth_offset(rn))
                                              ^~
engine.c:78:46: note: in definition of macro 'GET_OFFSET'
 #define GET_OFFSET(rn) ((rn)->next_off ? (rn)->next_off : get_synth_offset(rn))
                                              ^~
engine.c:1308:30: error: 'regnode' {aka 'struct regnode'} has no member named 'flags'
     if (++(a->spent) >= a->rn->flags)
                              ^~
engine.c: In function 'bump_regular':
engine.c:78:29: error: 'regnode' {aka 'struct regnode'} has no member named 'next_off'
 #define GET_OFFSET(rn) ((rn)->next_off ? (rn)->next_off : get_synth_offset(rn))
                             ^~
engine.c:78:29: note: in definition of macro 'GET_OFFSET'
 #define GET_OFFSET(rn) ((rn)->next_off ? (rn)->next_off : get_synth_offset(rn))
                             ^~
engine.c:78:46: error: 'regnode' {aka 'struct regnode'} has no member named 'next_off'
 #define GET_OFFSET(rn) ((rn)->next_off ? (rn)->next_off : get_synth_offset(rn))
                                              ^~
engine.c:78:46: note: in definition of macro 'GET_OFFSET'
 #define GET_OFFSET(rn) ((rn)->next_off ? (rn)->next_off : get_synth_offset(rn))
                                              ^~
engine.c: In function 'bump_with_check':
engine.c:1338:14: error: 'regnode' {aka 'struct regnode'} has no member named 'type'
     if (a->rn->type == END)
              ^~
engine.c:1342:20: error: 'regnode' {aka 'struct regnode'} has no member named 'type'
     else if ((a->rn->type == EXACT) || (a->rn->type == EXACTF) || (a->rn->type == EXACTFU)
                    ^~
engine.c:1342:46: error: 'regnode' {aka 'struct regnode'} has no member named 'type'
     else if ((a->rn->type == EXACT) || (a->rn->type == EXACTF) || (a->rn->type == EXACTFU)
                                              ^~
engine.c:1342:73: error: 'regnode' {aka 'struct regnode'} has no member named 'type'
     else if ((a->rn->type == EXACT) || (a->rn->type == EXACTF) || (a->rn->type == EXACTFU)
                                                                         ^~
engine.c: In function 'get_jump_offset':
engine.c:78:29: error: 'regnode' {aka 'struct regnode'} has no member named 'next_off'
 #define GET_OFFSET(rn) ((rn)->next_off ? (rn)->next_off : get_synth_offset(rn))
                             ^~
engine.c:78:29: note: in definition of macro 'GET_OFFSET'
 #define GET_OFFSET(rn) ((rn)->next_off ? (rn)->next_off : get_synth_offset(rn))
                             ^~
engine.c:78:46: error: 'regnode' {aka 'struct regnode'} has no member named 'next_off'
 #define GET_OFFSET(rn) ((rn)->next_off ? (rn)->next_off : get_synth_offset(rn))
                                              ^~
engine.c:78:46: note: in definition of macro 'GET_OFFSET'
 #define GET_OFFSET(rn) ((rn)->next_off ? (rn)->next_off : get_synth_offset(rn))
                                              ^~
engine.c:1373:27: error: 'regnode' {aka 'struct regnode'} has no member named 'type'
     while (trivial_nodes[q->type])
                           ^~
engine.c:78:29: error: 'regnode' {aka 'struct regnode'} has no member named 'next_off'
 #define GET_OFFSET(rn) ((rn)->next_off ? (rn)->next_off : get_synth_offset(rn))
                             ^~
engine.c:78:29: note: in definition of macro 'GET_OFFSET'
 #define GET_OFFSET(rn) ((rn)->next_off ? (rn)->next_off : get_synth_offset(rn))
                             ^~
engine.c:78:46: error: 'regnode' {aka 'struct regnode'} has no member named 'next_off'
 #define GET_OFFSET(rn) ((rn)->next_off ? (rn)->next_off : get_synth_offset(rn))
                                              ^~
engine.c:78:46: note: in definition of macro 'GET_OFFSET'
 #define GET_OFFSET(rn) ((rn)->next_off ? (rn)->next_off : get_synth_offset(rn))
                                              ^~
engine.c: In function 'get_bitmap_byte':
engine.c:1721:24: error: 'regnode' {aka 'struct regnode'} has no member named 'type'
     if ((i >= 16) && (p->type == ANYOFD) &&
                        ^~
engine.c:1722:11: error: 'regnode' {aka 'struct regnode'} has no member named 'flags'
         (p->flags & ANYOF_SHARED_d_MATCHES_ALL_NON_UTF8_NON_ASCII_non_d_WARN_SUPER))
           ^~
engine.c:1722:21: error: 'ANYOF_SHARED_d_MATCHES_ALL_NON_UTF8_NON_ASCII_non_d_WARN_SUPER' undeclared (first use in this function)
         (p->flags & ANYOF_SHARED_d_MATCHES_ALL_NON_UTF8_NON_ASCII_non_d_WARN_SUPER))
                     ^~~~~~~~~~~~~~~~~~~~~~~~~~~~~~~~~~~~~~~~~~~~~~~~~~~~~~~~~~~~~~
engine.c:1731:10: error: 'regnode' {aka 'struct regnode'} has no member named 'flags'
     if (p->flags & ANYOF_INVERT)
          ^~
engine.c: In function 'compare_anyof_multiline':
engine.c:1798:15: error: 'regnode' {aka 'struct regnode'} has no member named 'flags'
     if (a1->rn->flags & ANYOF_MATCHES_ALL_ABOVE_BITMAP)
               ^~
engine.c:1798:25: error: 'ANYOF_MATCHES_ALL_ABOVE_BITMAP' undeclared (first use in this function); did you mean 'ANYOF_MATCHES_ALL_OUTSIDE_BITMAP'?
     if (a1->rn->flags & ANYOF_MATCHES_ALL_ABOVE_BITMAP)
                         ^~~~~~~~~~~~~~~~~~~~~~~~~~~~~~
                         ANYOF_MATCHES_ALL_OUTSIDE_BITMAP
engine.c: In function 'compare_anyof_anyof':
engine.c:1968:9: error: 'ANYOF_SHARED_d_UPPER_LATIN1_UTF8_STRING_MATCHES_non_d_RUNTIME_USER_PROP' undeclared (first use in this function)
         ANYOF_SHARED_d_UPPER_LATIN1_UTF8_STRING_MATCHES_non_d_RUNTIME_USER_PROP;
         ^~~~~~~~~~~~~~~~~~~~~~~~~~~~~~~~~~~~~~~~~~~~~~~~~~~~~~~~~~~~~~~~~~~~~~~
engine.c:1969:31: error: 'regnode' {aka 'struct regnode'} has no member named 'flags'
     if ((extra_left || (a1->rn->flags & ANYOF_MATCHES_ALL_ABOVE_BITMAP)) &&
                               ^~
engine.c:1969:41: error: 'ANYOF_MATCHES_ALL_ABOVE_BITMAP' undeclared (first use in this function); did you mean 'ANYOF_MATCHES_ALL_OUTSIDE_BITMAP'?
     if ((extra_left || (a1->rn->flags & ANYOF_MATCHES_ALL_ABOVE_BITMAP)) &&
                                         ^~~~~~~~~~~~~~~~~~~~~~~~~~~~~~
                                         ANYOF_MATCHES_ALL_OUTSIDE_BITMAP
engine.c:1970:17: error: 'regnode' {aka 'struct regnode'} has no member named 'flags'
         !(a2->rn->flags & ANYOF_MATCHES_ALL_ABOVE_BITMAP))
                 ^~
engine.c:1980:20: error: 'regnode' {aka 'struct regnode'} has no member named 'flags'
         if ((a1->rn->flags & ANYOF_SHARED_d_UPPER_LATIN1_UTF8_STRING_MATCHES_non_d_RUNTIME_USER_PROP) &&
                    ^~
engine.c:1981:20: error: 'regnode' {aka 'struct regnode'} has no member named 'flags'
             (a2->rn->flags & ANYOF_SHARED_d_UPPER_LATIN1_UTF8_STRING_MATCHES_non_d_RUNTIME_USER_PROP))
                    ^~
engine.c: In function 'compare_anyof_anyofm':
engine.c:2145:31: error: 'ANYOF_SHARED_d_UPPER_LATIN1_UTF8_STRING_MATCHES_non_d_RUNTIME_USER_PROP' undeclared (first use in this function)
     if (ANYOF_FLAGS(a1->rn) & ANYOF_SHARED_d_UPPER_LATIN1_UTF8_STRING_MATCHES_non_d_RUNTIME_USER_PROP)
                               ^~~~~~~~~~~~~~~~~~~~~~~~~~~~~~~~~~~~~~~~~~~~~~~~~~~~~~~~~~~~~~~~~~~~~~~
engine.c: In function 'compare_anyof_nanyofm':
engine.c:2208:16: error: 'regnode' {aka 'struct regnode'} has no member named 'flags'
     if ((a1->rn->flags & ANYOF_SHARED_d_UPPER_LATIN1_UTF8_STRING_MATCHES_non_d_RUNTIME_USER_PROP) ||
                ^~
engine.c:2208:26: error: 'ANYOF_SHARED_d_UPPER_LATIN1_UTF8_STRING_MATCHES_non_d_RUNTIME_USER_PROP' undeclared (first use in this function)
     if ((a1->rn->flags & ANYOF_SHARED_d_UPPER_LATIN1_UTF8_STRING_MATCHES_non_d_RUNTIME_USER_PROP) ||
                          ^~~~~~~~~~~~~~~~~~~~~~~~~~~~~~~~~~~~~~~~~~~~~~~~~~~~~~~~~~~~~~~~~~~~~~~
engine.c:2209:17: error: 'regnode' {aka 'struct regnode'} has no member named 'flags'
         ((a1->rn->flags & ANYOF_SHARED_d_MATCHES_ALL_NON_UTF8_NON_ASCII_non_d_WARN_SUPER) &&
                 ^~
engine.c:2209:27: error: 'ANYOF_SHARED_d_MATCHES_ALL_NON_UTF8_NON_ASCII_non_d_WARN_SUPER' undeclared (first use in this function)
         ((a1->rn->flags & ANYOF_SHARED_d_MATCHES_ALL_NON_UTF8_NON_ASCII_non_d_WARN_SUPER) &&
                           ^~~~~~~~~~~~~~~~~~~~~~~~~~~~~~~~~~~~~~~~~~~~~~~~~~~~~~~~~~~~~~
engine.c:2210:18: error: 'regnode' {aka 'struct regnode'} has no member named 'flags'
          !(a1->rn->flags & ANYOF_INVERT)))
                  ^~
engine.c: In function 'compare_exact_posix':
engine.c:2420:10: warning: implicit declaration of function '_generic_isCC_A'; did you mean 'generic_isCC_'? [-Wimplicit-function-declaration]
     if (!_generic_isCC_A(*seq, a2->rn->flags))
          ^~~~~~~~~~~~~~~
          generic_isCC_
engine.c:2420:38: error: 'regnode' {aka 'struct regnode'} has no member named 'flags'
     if (!_generic_isCC_A(*seq, a2->rn->flags))
                                      ^~
engine.c: In function 'compare_exactf_posix':
engine.c:2442:44: error: 'regnode' {aka 'struct regnode'} has no member named 'flags'
         if (!_generic_isCC_A(unf[i], a2->rn->flags))
                                            ^~
engine.c: In function 'compare_exact_negative_posix':
engine.c:2461:37: error: 'regnode' {aka 'struct regnode'} has no member named 'flags'
     if (_generic_isCC_A(*seq, a2->rn->flags))
                                     ^~
engine.c: In function 'compare_exactf_negative_posix':
engine.c:2484:43: error: 'regnode' {aka 'struct regnode'} has no member named 'flags'
         if (_generic_isCC_A(unf[i], a2->rn->flags))
                                           ^~
engine.c: In function 'compare_posix_anyof':
engine.c:2519:17: error: 'regnode' {aka 'struct regnode'} has no member named 'flags'
     if (!(a2->rn->flags & ANYOF_MATCHES_ALL_ABOVE_BITMAP))
                 ^~
engine.c:2519:27: error: 'ANYOF_MATCHES_ALL_ABOVE_BITMAP' undeclared (first use in this function); did you mean 'ANYOF_MATCHES_ALL_OUTSIDE_BITMAP'?
     if (!(a2->rn->flags & ANYOF_MATCHES_ALL_ABOVE_BITMAP))
                           ^~~~~~~~~~~~~~~~~~~~~~~~~~~~~~
                           ANYOF_MATCHES_ALL_OUTSIDE_BITMAP
engine.c:2537:15: error: 'regnode' {aka 'struct regnode'} has no member named 'flags'
     if (a1->rn->flags >= SIZEOF_ARRAY(posix_regclass_bitmaps))
               ^~
engine.c:2542:38: error: 'regnode' {aka 'struct regnode'} has no member named 'flags'
     b = posix_regclass_bitmaps[a1->rn->flags];
                                      ^~
engine.c: In function 'compare_negative_posix_anyof':
engine.c:2573:17: error: 'regnode' {aka 'struct regnode'} has no member named 'flags'
     if (!(a2->rn->flags & ANYOF_MATCHES_ALL_ABOVE_BITMAP))
                 ^~
engine.c:2573:27: error: 'ANYOF_MATCHES_ALL_ABOVE_BITMAP' undeclared (first use in this function); did you mean 'ANYOF_MATCHES_ALL_OUTSIDE_BITMAP'?
     if (!(a2->rn->flags & ANYOF_MATCHES_ALL_ABOVE_BITMAP))
                           ^~~~~~~~~~~~~~~~~~~~~~~~~~~~~~
                           ANYOF_MATCHES_ALL_OUTSIDE_BITMAP
engine.c:2583:19: error: 'regnode' {aka 'struct regnode'} has no member named 'flags'
         if (a2->rn->flags & ANYOF_INVERT)
                   ^~
engine.c:2596:15: error: 'regnode' {aka 'struct regnode'} has no member named 'flags'
     if (a1->rn->flags >= SIZEOF_ARRAY(posix_regclass_bitmaps))
               ^~
engine.c:2601:39: error: 'regnode' {aka 'struct regnode'} has no member named 'flags'
     b = posix_regclass_nbitmaps[a1->rn->flags];
                                       ^~
engine.c: In function 'compare_posix_nanyofm':
engine.c:2851:15: error: 'regnode' {aka 'struct regnode'} has no member named 'flags'
     if (a1->rn->flags >= SIZEOF_ARRAY(posix_regclass_bitmaps))
               ^~
engine.c:2856:38: error: 'regnode' {aka 'struct regnode'} has no member named 'flags'
     b = posix_regclass_bitmaps[a1->rn->flags];
                                      ^~
engine.c: In function 'compare_negative_posix_nanyofm':
engine.c:2885:15: error: 'regnode' {aka 'struct regnode'} has no member named 'flags'
     if (a1->rn->flags >= SIZEOF_ARRAY(posix_regclass_bitmaps))
               ^~
engine.c:2891:38: error: 'regnode' {aka 'struct regnode'} has no member named 'flags'
     b = posix_regclass_bitmaps[a1->rn->flags];
                                      ^~
engine.c: In function 'compare_exact_lnbreak':
engine.c:2917:52: error: 'regnode' {aka 'struct regnode'} has no member named 'flags'
     if ((*cur == '\r') && ((a1->spent + 1) < a1->rn->flags))
                                                    ^~
engine.c: In function 'compare_sany_anyof':
engine.c:2975:15: error: 'regnode' {aka 'struct regnode'} has no member named 'flags'
     if (a2->rn->flags & ANYOF_MATCHES_ALL_ABOVE_BITMAP)
               ^~
engine.c:2975:25: error: 'ANYOF_MATCHES_ALL_ABOVE_BITMAP' undeclared (first use in this function); did you mean 'ANYOF_MATCHES_ALL_OUTSIDE_BITMAP'?
     if (a2->rn->flags & ANYOF_MATCHES_ALL_ABOVE_BITMAP)
                         ^~~~~~~~~~~~~~~~~~~~~~~~~~~~~~
                         ANYOF_MATCHES_ALL_OUTSIDE_BITMAP
engine.c: In function 'compare_anyof_posix':
engine.c:3063:15: error: 'regnode' {aka 'struct regnode'} has no member named 'flags'
     if (a2->rn->flags >= SIZEOF_ARRAY(posix_regclass_bitmaps))
               ^~
engine.c:3069:38: error: 'regnode' {aka 'struct regnode'} has no member named 'flags'
     b = posix_regclass_bitmaps[a2->rn->flags];
                                      ^~
engine.c: In function 'compare_anyofm_posix':
engine.c:3120:38: error: 'regnode' {aka 'struct regnode'} has no member named 'flags'
     b = posix_regclass_bitmaps[a2->rn->flags];
                                      ^~
engine.c: In function 'compare_nanyofm_posix':
engine.c:3142:39: error: 'regnode' {aka 'struct regnode'} has no member named 'flags'
     b = posix_regclass_nbitmaps[a2->rn->flags];
                                       ^~
engine.c: In function 'compare_anyof_posixa':
engine.c:3160:31: error: 'ANYOF_SHARED_d_UPPER_LATIN1_UTF8_STRING_MATCHES_non_d_RUNTIME_USER_PROP' undeclared (first use in this function)
     if (ANYOF_FLAGS(a1->rn) & ANYOF_SHARED_d_UPPER_LATIN1_UTF8_STRING_MATCHES_non_d_RUNTIME_USER_PROP)
                               ^~~~~~~~~~~~~~~~~~~~~~~~~~~~~~~~~~~~~~~~~~~~~~~~~~~~~~~~~~~~~~~~~~~~~~~
engine.c:3165:15: error: 'regnode' {aka 'struct regnode'} has no member named 'flags'
     if (a2->rn->flags >= SIZEOF_ARRAY(posix_regclass_bitmaps))
               ^~
engine.c:3171:38: error: 'regnode' {aka 'struct regnode'} has no member named 'flags'
     b = posix_regclass_bitmaps[a2->rn->flags];
                                      ^~
engine.c: In function 'compare_anyof_negative_posix':
engine.c:3191:15: error: 'regnode' {aka 'struct regnode'} has no member named 'flags'
     if (a2->rn->flags >= SIZEOF_ARRAY(posix_regclass_nbitmaps))
               ^~
engine.c:3197:39: error: 'regnode' {aka 'struct regnode'} has no member named 'flags'
     b = posix_regclass_nbitmaps[a2->rn->flags];
                                       ^~
engine.c: In function 'compare_anyofm_negative_posix':
engine.c:3257:15: error: 'regnode' {aka 'struct regnode'} has no member named 'flags'
     if (a2->rn->flags >= SIZEOF_ARRAY(posix_regclass_nbitmaps))
               ^~
engine.c:3263:50: error: 'regnode' {aka 'struct regnode'} has no member named 'flags'
     posix_bitmap = posix_regclass_nbitmaps[a2->rn->flags];
                                                  ^~
engine.c: In function 'compare_nanyofm_negative_posix':
engine.c:3287:15: error: 'regnode' {aka 'struct regnode'} has no member named 'flags'
     if (a2->rn->flags >= SIZEOF_ARRAY(posix_regclass_bitmaps))
               ^~
engine.c:3292:49: error: 'regnode' {aka 'struct regnode'} has no member named 'flags'
     posix_bitmap = posix_regclass_bitmaps[a2->rn->flags];
                                                 ^~
engine.c: In function 'compare_posix_reg_any':
engine.c:3307:22: error: 'regnode' {aka 'struct regnode'} has no member named 'flags'
     U8 flags = a1->rn->flags;
                      ^~
engine.c: In function 'compare_negative_posix_reg_any':
engine.c:3329:22: error: 'regnode' {aka 'struct regnode'} has no member named 'flags'
     U8 flags = a1->rn->flags;
                      ^~
engine.c: In function 'compare_posix_lnbreak':
engine.c:3350:15: error: 'regnode' {aka 'struct regnode'} has no member named 'flags'
     if (a1->rn->flags != _CC_VERTSPACE)
               ^~
engine.c: In function 'compare_anyof_exact':
engine.c:3368:15: error: 'regnode' {aka 'struct regnode'} has no member named 'flags'
     if (a1->rn->flags & ANYOF_MATCHES_ALL_ABOVE_BITMAP)
               ^~
engine.c:3368:25: error: 'ANYOF_MATCHES_ALL_ABOVE_BITMAP' undeclared (first use in this function); did you mean 'ANYOF_MATCHES_ALL_OUTSIDE_BITMAP'?
     if (a1->rn->flags & ANYOF_MATCHES_ALL_ABOVE_BITMAP)
                         ^~~~~~~~~~~~~~~~~~~~~~~~~~~~~~
                         ANYOF_MATCHES_ALL_OUTSIDE_BITMAP
engine.c: In function 'compare_anyof_exactf':
engine.c:3463:15: error: 'regnode' {aka 'struct regnode'} has no member named 'flags'
     if (a1->rn->flags & ANYOF_MATCHES_ALL_ABOVE_BITMAP)
               ^~
engine.c:3463:25: error: 'ANYOF_MATCHES_ALL_ABOVE_BITMAP' undeclared (first use in this function); did you mean 'ANYOF_MATCHES_ALL_OUTSIDE_BITMAP'?
     if (a1->rn->flags & ANYOF_MATCHES_ALL_ABOVE_BITMAP)
                         ^~~~~~~~~~~~~~~~~~~~~~~~~~~~~~
                         ANYOF_MATCHES_ALL_OUTSIDE_BITMAP
engine.c: In function 'compare_left_branch':
engine.c:3655:14: error: 'regnode' {aka 'struct regnode'} has no member named 'type'
     while (p1->type == BRANCH)
              ^~
engine.c:3657:15: error: 'regnode' {aka 'struct regnode'} has no member named 'next_off'
         if (p1->next_off == 0)
               ^~
engine.c:3683:17: error: 'regnode' {aka 'struct regnode'} has no member named 'next_off'
         p1 += p1->next_off;
                 ^~
engine.c: In function 'compare_set':
engine.c:78:29: error: 'regnode' {aka 'struct regnode'} has no member named 'next_off'
 #define GET_OFFSET(rn) ((rn)->next_off ? (rn)->next_off : get_synth_offset(rn))
                             ^~
engine.c:78:29: note: in definition of macro 'GET_OFFSET'
 #define GET_OFFSET(rn) ((rn)->next_off ? (rn)->next_off : get_synth_offset(rn))
                             ^~
engine.c:78:46: error: 'regnode' {aka 'struct regnode'} has no member named 'next_off'
 #define GET_OFFSET(rn) ((rn)->next_off ? (rn)->next_off : get_synth_offset(rn))
                                              ^~
engine.c:78:46: note: in definition of macro 'GET_OFFSET'
 #define GET_OFFSET(rn) ((rn)->next_off ? (rn)->next_off : get_synth_offset(rn))
                                              ^~
engine.c:3728:11: error: 'regnode' {aka 'struct regnode'} has no member named 'flags'
     alt[0].flags = 1;
           ^
engine.c:3729:11: error: 'regnode' {aka 'struct regnode'} has no member named 'type'
     alt[0].type = EXACT;
           ^
engine.c:3730:11: error: 'regnode' {aka 'struct regnode'} has no member named 'next_off'
     alt[0].next_off = 2;
           ^
engine.c:3751:23: error: 'regnode' {aka 'struct regnode'} has no member named 'flags'
                 alt[1].flags = 8 * i + j;
                       ^
engine.c: In function 'compare_right_branch':
engine.c:3849:15: error: 'regnode' {aka 'struct regnode'} has no member named 'type'
     while ((p2->type == BRANCH) && !rv)
               ^~
engine.c:3856:15: error: 'regnode' {aka 'struct regnode'} has no member named 'next_off'
         if (p2->next_off == 0)
               ^~
engine.c:3868:17: error: 'regnode' {aka 'struct regnode'} has no member named 'next_off'
         p2 += p2->next_off;
                 ^~
engine.c: In function 'compare_right_star':
engine.c:78:29: error: 'regnode' {aka 'struct regnode'} has no member named 'next_off'
 #define GET_OFFSET(rn) ((rn)->next_off ? (rn)->next_off : get_synth_offset(rn))
                             ^~
engine.c:78:29: note: in definition of macro 'GET_OFFSET'
 #define GET_OFFSET(rn) ((rn)->next_off ? (rn)->next_off : get_synth_offset(rn))
                             ^~
engine.c:78:46: error: 'regnode' {aka 'struct regnode'} has no member named 'next_off'
 #define GET_OFFSET(rn) ((rn)->next_off ? (rn)->next_off : get_synth_offset(rn))
                                              ^~
engine.c:78:46: note: in definition of macro 'GET_OFFSET'
 #define GET_OFFSET(rn) ((rn)->next_off ? (rn)->next_off : get_synth_offset(rn))
                                              ^~
engine.c: In function 'compare_plus_plus':
engine.c:78:29: error: 'regnode' {aka 'struct regnode'} has no member named 'next_off'
 #define GET_OFFSET(rn) ((rn)->next_off ? (rn)->next_off : get_synth_offset(rn))
                             ^~
engine.c:78:29: note: in definition of macro 'GET_OFFSET'
 #define GET_OFFSET(rn) ((rn)->next_off ? (rn)->next_off : get_synth_offset(rn))
                             ^~
engine.c:78:46: error: 'regnode' {aka 'struct regnode'} has no member named 'next_off'
 #define GET_OFFSET(rn) ((rn)->next_off ? (rn)->next_off : get_synth_offset(rn))
                                              ^~
engine.c:78:46: note: in definition of macro 'GET_OFFSET'
 #define GET_OFFSET(rn) ((rn)->next_off ? (rn)->next_off : get_synth_offset(rn))
                                              ^~
engine.c: In function 'compare_repeat_star':
engine.c:78:29: error: 'regnode' {aka 'struct regnode'} has no member named 'next_off'
 #define GET_OFFSET(rn) ((rn)->next_off ? (rn)->next_off : get_synth_offset(rn))
                             ^~
engine.c:78:29: note: in definition of macro 'GET_OFFSET'
 #define GET_OFFSET(rn) ((rn)->next_off ? (rn)->next_off : get_synth_offset(rn))
                             ^~
engine.c:78:46: error: 'regnode' {aka 'struct regnode'} has no member named 'next_off'
 #define GET_OFFSET(rn) ((rn)->next_off ? (rn)->next_off : get_synth_offset(rn))
                                              ^~
engine.c:78:46: note: in definition of macro 'GET_OFFSET'
 #define GET_OFFSET(rn) ((rn)->next_off ? (rn)->next_off : get_synth_offset(rn))
                                              ^~
engine.c: In function 'compare_right_curly_from_zero':
engine.c:78:29: error: 'regnode' {aka 'struct regnode'} has no member named 'next_off'
 #define GET_OFFSET(rn) ((rn)->next_off ? (rn)->next_off : get_synth_offset(rn))
                             ^~
engine.c:78:29: note: in definition of macro 'GET_OFFSET'
 #define GET_OFFSET(rn) ((rn)->next_off ? (rn)->next_off : get_synth_offset(rn))
                             ^~
engine.c:78:46: error: 'regnode' {aka 'struct regnode'} has no member named 'next_off'
 #define GET_OFFSET(rn) ((rn)->next_off ? (rn)->next_off : get_synth_offset(rn))
                                              ^~
engine.c:78:46: note: in definition of macro 'GET_OFFSET'
 #define GET_OFFSET(rn) ((rn)->next_off ? (rn)->next_off : get_synth_offset(rn))
                                              ^~
engine.c: In function 'compare_left_plus':
engine.c:4172:14: error: 'regnode' {aka 'struct regnode'} has no member named 'type'
         if (q->type != END)
              ^~
engine.c:4182:38: error: 'regnode' {aka 'struct regnode'} has no member named 'type'
             orig_type = alt[end_offs].type;
                                      ^
engine.c:4183:26: error: 'regnode' {aka 'struct regnode'} has no member named 'type'
             alt[end_offs].type = END;
                          ^
engine.c:4199:26: error: 'regnode' {aka 'struct regnode'} has no member named 'type'
             alt[end_offs].type = orig_type;
                          ^
engine.c: In function 'compare_plus_curly':
engine.c:4366:15: error: 'regnode' {aka 'struct regnode'} has no member named 'type'
         if (e2->type != END)
               ^~
engine.c: In function 'compare_left_curly':
engine.c:78:29: error: 'regnode' {aka 'struct regnode'} has no member named 'next_off'
 #define GET_OFFSET(rn) ((rn)->next_off ? (rn)->next_off : get_synth_offset(rn))
                             ^~
engine.c:78:29: note: in definition of macro 'GET_OFFSET'
 #define GET_OFFSET(rn) ((rn)->next_off ? (rn)->next_off : get_synth_offset(rn))
                             ^~
engine.c:78:46: error: 'regnode' {aka 'struct regnode'} has no member named 'next_off'
 #define GET_OFFSET(rn) ((rn)->next_off ? (rn)->next_off : get_synth_offset(rn))
                                              ^~
engine.c:78:46: note: in definition of macro 'GET_OFFSET'
 #define GET_OFFSET(rn) ((rn)->next_off ? (rn)->next_off : get_synth_offset(rn))
                                              ^~
engine.c:4485:14: error: 'regnode' {aka 'struct regnode'} has no member named 'type'
         if (q->type != END)
              ^~
engine.c:4495:26: error: 'regnode' {aka 'struct regnode'} has no member named 'type'
             alt[end_offs].type = END;
                          ^
engine.c: In function 'compare_right_curly':
engine.c:78:29: error: 'regnode' {aka 'struct regnode'} has no member named 'next_off'
 #define GET_OFFSET(rn) ((rn)->next_off ? (rn)->next_off : get_synth_offset(rn))
                             ^~
engine.c:78:29: note: in definition of macro 'GET_OFFSET'
 #define GET_OFFSET(rn) ((rn)->next_off ? (rn)->next_off : get_synth_offset(rn))
                             ^~
engine.c:78:46: error: 'regnode' {aka 'struct regnode'} has no member named 'next_off'
 #define GET_OFFSET(rn) ((rn)->next_off ? (rn)->next_off : get_synth_offset(rn))
                                              ^~
engine.c:78:46: note: in definition of macro 'GET_OFFSET'
 #define GET_OFFSET(rn) ((rn)->next_off ? (rn)->next_off : get_synth_offset(rn))
                                              ^~
engine.c:4616:19: error: 'regnode' {aka 'struct regnode'} has no member named 'type'
         if (a1->rn->type == END)
                   ^~
engine.c: In function 'compare_curly_curly':
engine.c:4706:15: error: 'regnode' {aka 'struct regnode'} has no member named 'type'
         if (e2->type != END)
               ^~
engine.c: In function 'compare_bound':
engine.c:4742:16: error: 'regnode' {aka 'struct regnode'} has no member named 'type'
     t = left.rn->type;
                ^~
engine.c:4752:20: error: 'regnode' {aka 'struct regnode'} has no member named 'flags'
         if (left.rn->flags & ANYOF_MATCHES_ALL_ABOVE_BITMAP)
                    ^~
engine.c:4752:30: error: 'ANYOF_MATCHES_ALL_ABOVE_BITMAP' undeclared (first use in this function); did you mean 'ANYOF_MATCHES_ALL_OUTSIDE_BITMAP'?
         if (left.rn->flags & ANYOF_MATCHES_ALL_ABOVE_BITMAP)
                              ^~~~~~~~~~~~~~~~~~~~~~~~~~~~~~
                              ANYOF_MATCHES_ALL_OUTSIDE_BITMAP
engine.c:4794:25: error: 'regnode' {aka 'struct regnode'} has no member named 'flags'
       U8 flags = left.rn->flags;
                         ^~
engine.c: In function 'compare_anyof_bound':
engine.c:4892:15: error: 'regnode' {aka 'struct regnode'} has no member named 'flags'
     if (a1->rn->flags & ANYOF_MATCHES_ALL_ABOVE_BITMAP)
               ^~
engine.c:4892:25: error: 'ANYOF_MATCHES_ALL_ABOVE_BITMAP' undeclared (first use in this function); did you mean 'ANYOF_MATCHES_ALL_OUTSIDE_BITMAP'?
     if (a1->rn->flags & ANYOF_MATCHES_ALL_ABOVE_BITMAP)
                         ^~~~~~~~~~~~~~~~~~~~~~~~~~~~~~
                         ANYOF_MATCHES_ALL_OUTSIDE_BITMAP
engine.c: In function 'compare_anyof_nbound':
engine.c:4905:15: error: 'regnode' {aka 'struct regnode'} has no member named 'flags'
     if (a1->rn->flags & ANYOF_MATCHES_ALL_ABOVE_BITMAP)
               ^~
engine.c:4905:25: error: 'ANYOF_MATCHES_ALL_ABOVE_BITMAP' undeclared (first use in this function); did you mean 'ANYOF_MATCHES_ALL_OUTSIDE_BITMAP'?
     if (a1->rn->flags & ANYOF_MATCHES_ALL_ABOVE_BITMAP)
                         ^~~~~~~~~~~~~~~~~~~~~~~~~~~~~~
                         ANYOF_MATCHES_ALL_OUTSIDE_BITMAP
engine.c: In function 'compare_posix_bound':
engine.c:5013:22: error: 'regnode' {aka 'struct regnode'} has no member named 'flags'
     U8 flags = a1->rn->flags;
                      ^~
engine.c: In function 'compare_posix_nbound':
engine.c:5034:22: error: 'regnode' {aka 'struct regnode'} has no member named 'flags'
     U8 flags = a1->rn->flags;
                      ^~
engine.c: In function 'compare_negative_posix_word_bound':
engine.c:5057:15: error: 'regnode' {aka 'struct regnode'} has no member named 'flags'
     if (a1->rn->flags != _CC_WORDCHAR)
               ^~
engine.c:5057:26: error: '_CC_WORDCHAR' undeclared (first use in this function); did you mean 'CC_WORDCHAR_'?
     if (a1->rn->flags != _CC_WORDCHAR)
                          ^~~~~~~~~~~~
                          CC_WORDCHAR_
engine.c: In function 'compare_negative_posix_word_nbound':
engine.c:5073:15: error: 'regnode' {aka 'struct regnode'} has no member named 'flags'
     if (a1->rn->flags != _CC_WORDCHAR)
               ^~
engine.c:5073:26: error: '_CC_WORDCHAR' undeclared (first use in this function); did you mean 'CC_WORDCHAR_'?
     if (a1->rn->flags != _CC_WORDCHAR)
                          ^~~~~~~~~~~~
                          CC_WORDCHAR_
engine.c: In function 'compare':
engine.c:5173:16: error: 'regnode' {aka 'struct regnode'} has no member named 'type'
     if ((a1->rn->type >= REGNODE_MAX) || (a2->rn->type >= REGNODE_MAX))
                ^~
engine.c:5173:49: error: 'regnode' {aka 'struct regnode'} has no member named 'type'
     if ((a1->rn->type >= REGNODE_MAX) || (a2->rn->type >= REGNODE_MAX))
                                                 ^~
engine.c:5179:26: error: 'regnode' {aka 'struct regnode'} has no member named 'type'
     cmp = dispatch[a1->rn->type][a2->rn->type];
                          ^~
engine.c:5179:40: error: 'regnode' {aka 'struct regnode'} has no member named 'type'
     cmp = dispatch[a1->rn->type][a2->rn->type];
                                        ^~
engine.c: In function 'rc_init':
engine.c:5284:27: error: '_CC_WORDCHAR' undeclared (first use in this function); did you mean 'CC_WORDCHAR_'?
     word_posix_regclasses[_CC_WORDCHAR] =
                           ^~~~~~~~~~~~
                           CC_WORDCHAR_
engine.c:5285:31: error: '_CC_DIGIT' undeclared (first use in this function); did you mean 'CC_DIGIT_'?
         word_posix_regclasses[_CC_DIGIT] =
                               ^~~~~~~~~
                               CC_DIGIT_
engine.c:5286:31: error: '_CC_ALPHA' undeclared (first use in this function); did you mean 'CC_ALPHA_'?
         word_posix_regclasses[_CC_ALPHA] =
                               ^~~~~~~~~
                               CC_ALPHA_
engine.c:5287:31: error: '_CC_LOWER' undeclared (first use in this function); did you mean 'CC_LOWER_'?
         word_posix_regclasses[_CC_LOWER] =
                               ^~~~~~~~~
                               CC_LOWER_
engine.c:5288:31: error: '_CC_UPPER' undeclared (first use in this function); did you mean 'CC_UPPER_'?
         word_posix_regclasses[_CC_UPPER] =
                               ^~~~~~~~~
                               CC_UPPER_
engine.c:5290:31: error: '_CC_ALPHANUMERIC' undeclared (first use in this function); did you mean 'CC_ALPHANUMERIC_'?
         word_posix_regclasses[_CC_ALPHANUMERIC] =
                               ^~~~~~~~~~~~~~~~
                               CC_ALPHANUMERIC_
engine.c:5291:31: error: '_CC_CASED' undeclared (first use in this function); did you mean 'CC_CASED_'?
         word_posix_regclasses[_CC_CASED] =
                               ^~~~~~~~~
                               CC_CASED_
engine.c:5292:31: error: '_CC_XDIGIT' undeclared (first use in this function); did you mean 'CC_XDIGIT_'?
         word_posix_regclasses[_CC_XDIGIT] = 1;
                               ^~~~~~~~~~
                               CC_XDIGIT_
engine.c:5296:31: error: '_CC_PUNCT' undeclared (first use in this function); did you mean 'CC_PUNCT_'?
     non_word_posix_regclasses[_CC_PUNCT] =
                               ^~~~~~~~~
                               CC_PUNCT_
engine.c:5297:35: error: '_CC_SPACE' undeclared (first use in this function); did you mean 'C1_SPACE'?
         non_word_posix_regclasses[_CC_SPACE] =
                                   ^~~~~~~~~
                                   C1_SPACE
engine.c:5298:35: error: '_CC_BLANK' undeclared (first use in this function); did you mean 'C1_BLANK'?
         non_word_posix_regclasses[_CC_BLANK] =
                                   ^~~~~~~~~
                                   C1_BLANK
engine.c:5304:34: error: '_CC_CNTRL' undeclared (first use in this function); did you mean 'CC_CNTRL_'?
         newline_posix_regclasses[_CC_CNTRL] =
                                  ^~~~~~~~~
                                  CC_CNTRL_
engine.c:5305:34: error: '_CC_ASCII' undeclared (first use in this function); did you mean 'CC_ASCII_'?
         newline_posix_regclasses[_CC_ASCII] =
                                  ^~~~~~~~~
                                  CC_ASCII_
gmake.EXE: *** [Makefile:343: engine.o] Error 1

------------------------------
PREREQUISITES
------------------------------

Prerequisite modules loaded:

build_requires:

    Module              Need Have
    ------------------- ---- ----
    ExtUtils::MakeMaker 0    7.70

configure_requires:

    Module              Need Have
    ------------------- ---- ----
    ExtUtils::MakeMaker 0    7.70


------------------------------
ENVIRONMENT AND OTHER CONTEXT
------------------------------

Environment variables:

    AUTOMATED_TESTING = 1
    COMSPEC = C:\WINDOWS\system32\cmd.exe
    NONINTERACTIVE_TESTING = 1
    NUMBER_OF_PROCESSORS = 2
    PATH = C:\WINDOWS\system32;C:\strawberry\c\bin;C:\strawberry\perl\site\bin;C:\strawberry\perl\bin
    PERL = C:\Strawberry\perl\bin\perl.exe
    PERL5LIB = 
    PERL5OPT = 
    PERL5_CPANPLUS_IS_RUNNING = 1764
    PERL5_CPAN_IS_RUNNING = 1764
    PERL5_CPAN_IS_RUNNING_IN_RECURSION = 8588,1764
    PERL_CR_SMOKER_CURRENT = Regexp-Compare-0.33
    PERL_EXTUTILS_AUTOINSTALL = --defaultdeps
    PERL_MM_USE_DEFAULT = 1
    PERL_USE_UNSAFE_INC = 1
    PROCESSOR_IDENTIFIER = x86 Family 6 Model 15 Stepping 11, GenuineIntel
    TEMP = C:\Users\smoker\AppData\Local\Temp

Perl special variables (and OS-specific diagnostics, for MSWin32):

    $^X = C:\Strawberry\perl\bin\perl.exe
    $UID/$EUID = 0 / 0
    $GID = 0
    $EGID = 0
    Win32::GetOSName = Win10
    Win32::GetOSVersion = , 10, 0, 19045, 2, 0, 0, 256, 1
    Win32::FsType = NTFS
    Win32::IsAdminUser = 0

Perl module toolchain versions installed:

    Module              Have    
    ------------------- --------
    CPAN                2.36    
    CPAN::Meta          2.150010
    Cwd                 3.89    
    ExtUtils::CBuilder  0.280238
    ExtUtils::Command   7.70    
    ExtUtils::Install   2.22    
    ExtUtils::MakeMaker 7.70    
    ExtUtils::Manifest  1.75    
    ExtUtils::ParseXS   3.51    
    File::Spec          3.88    
    JSON                4.10    
    JSON::PP            4.16    
    Module::Build       0.4234  
    Module::Signature   n/a     
    Parse::CPAN::Meta   2.150010
    Test2               1.302199
    Test::Harness       3.49_01 
    Test::More          1.302199
    YAML                1.31    
    YAML::Syck          1.34    
    version             0.9932  


--

Summary of my perl5 (revision 5 version 38 subversion 2) configuration:
   
  Platform:
    osname=MSWin32
    osvers=10.0.19045.4291
    archname=MSWin32-x86-multi-thread-64int
    uname='Win32 strawberry-perl 5.38.2.2 # 14:58:40 Sun April 21 2024 x32'
    config_args='undef'
    hint=recommended
    useposix=true
    d_sigaction=undef
    useithreads=define
    usemultiplicity=define
    use64bitint=define
    use64bitall=undef
    uselongdouble=undef
    usemymalloc=n
    default_inc_excludes_dot=define
  Compiler:
    cc='gcc'
    ccflags =' -DWIN32  -DPERL_TEXTMODE_SCRIPTS -DMULTIPLICITY -DPERL_IMPLICIT_SYS -DUSE_PERLIO -D__USE_MINGW_ANSI_STDIO -fwrapv -fno-strict-aliasing -mms-bitfields'
    optimize='-Os -falign-functions -falign-jumps -falign-labels -falign-loops -freorder-blocks -freorder-blocks-algorithm=stc -freorder-blocks-and-partition'
    cppflags='-DWIN32'
    ccversion=''
    gccversion='8.3.0'
    gccosandvers=''
    intsize=4
    longsize=4
    ptrsize=4
    doublesize=8
    byteorder=12345678
    doublekind=3
    d_longlong=define
    longlongsize=8
    d_longdbl=define
    longdblsize=12
    longdblkind=3
    ivtype='long long'
    ivsize=8
    nvtype='double'
    nvsize=8
    Off_t='long long'
    lseeksize=8
    alignbytes=8
    prototype=define
  Linker and Libraries:
    ld='g++'
    ldflags ='-s -L"C:\strawberry\perl\lib\CORE" -L"C:\strawberry\c\lib" -L"C:\strawberry\c\i686-w64-mingw32\lib" -L"C:\strawberry\c\lib\gcc\i686-w64-mingw32\8.3.0"'
    libpth=C:\strawberry\c\lib C:\strawberry\c\i686-w64-mingw32\lib C:\strawberry\c\lib\gcc\i686-w64-mingw32\8.3.0 C:\strawberry\c\i686-w64-mingw32\lib C:\strawberry\c\lib\gcc\i686-w64-mingw32\8.3.0
    libs= -lmoldname -lkernel32 -luser32 -lgdi32 -lwinspool -lcomdlg32 -ladvapi32 -lshell32 -lole32 -loleaut32 -lnetapi32 -luuid -lws2_32 -lmpr -lwinmm -lversion -lodbc32 -lodbccp32 -lcomctl32
    perllibs= -lmoldname -lkernel32 -luser32 -lgdi32 -lwinspool -lcomdlg32 -ladvapi32 -lshell32 -lole32 -loleaut32 -lnetapi32 -luuid -lws2_32 -lmpr -lwinmm -lversion -lodbc32 -lodbccp32 -lcomctl32
    libc=
    so=dll
    useshrplib=true
    libperl=libperl538.a
    gnulibc_version=''
  Dynamic Linking:
    dlsrc=dl_win32.xs
    dlext=xs.dll
    d_dlsymun=undef
    ccdlflags=' '
    cccdlflags=' '
    lddlflags='-shared -s -L"C:\strawberry\perl\lib\CORE" -L"C:\strawberry\c\lib" -L"C:\strawberry\c\i686-w64-mingw32\lib" -L"C:\strawberry\c\lib\gcc\i686-w64-mingw32\8.3.0"'


Characteristics of this binary (from libperl): 
  Compile-time options:
    HAS_LONG_DOUBLE
    HAS_TIMES
    HAVE_INTERP_INTERN
    MULTIPLICITY
    PERLIO_LAYERS
    PERL_COPY_ON_WRITE
    PERL_DONT_CREATE_GVSV
    PERL_HASH_FUNC_SIPHASH13
    PERL_HASH_USE_SBOX32
    PERL_IMPLICIT_SYS
    PERL_MALLOC_WRAP
    PERL_OP_PARENT
    PERL_PRESERVE_IVUV
    PERL_USE_SAFE_PUTENV
    USE_64_BIT_INT
    USE_ITHREADS
    USE_LARGE_FILES
    USE_LOCALE
    USE_LOCALE_COLLATE
    USE_LOCALE_CTYPE
    USE_LOCALE_NUMERIC
    USE_LOCALE_TIME
    USE_PERLIO
    USE_PERL_ATOF
  Built under MSWin32
  Compiled at Apr 21 2024 17:11:56
  %ENV:
    PERL="C:\Strawberry\perl\bin\perl.exe"
    PERL5_CPANPLUS_IS_RUNNING="1764"
    PERL5_CPAN_IS_RUNNING="1764"
    PERL5_CPAN_IS_RUNNING_IN_RECURSION="8588,1764"
    PERL_CR_SMOKER_CURRENT="Regexp-Compare-0.33"
    PERL_EXTUTILS_AUTOINSTALL="--defaultdeps"
    PERL_MM_USE_DEFAULT="1"
    PERL_USE_UNSAFE_INC="1"
  @INC:
    C:/Strawberry/perl/site/lib/MSWin32-x86-multi-thread-64int
    C:/Strawberry/perl/site/lib
    C:/Strawberry/perl/vendor/lib
    C:/Strawberry/perl/lib
    .