Alien-CSFML vv0.0.7 Perl 5 v5.30.3 x86_64-linux

Status
Unknown
From
Slaven Rezić
Dist
Alien-CSFML vv0.0.7
Platform
Perl 5 v5.30.3 x86_64-linux
Date
2022-10-22T05:44:00
ID
87432e5e-51cc-11ed-ad6c-8ee06d8775ea
This distribution has been tested as part of the CPAN Testers
project, supporting the Perl programming language.  See
http://wiki.cpantesters.org/ for more information or email
questions to cpan-testers-discuss@perl.org


--
Dear Sanko Robinson,

This is a computer-generated report for Alien-CSFML-v0.0.7
on perl 5.30.3, created by CPAN-Reporter-1.2018.

Thank you for uploading your work to CPAN.  However, attempting to
test your distribution gave an inconclusive result.

This could be because your distribution had an error during the make/build
stage, did not define tests, tests could not be found, because your tests were
interrupted before they finished, or because the results of the tests could not
be parsed.  You may wish to consult the CPAN Testers Wiki:

http://wiki.cpantesters.org/wiki/CPANAuthorNotes

Sections of this report:

    * Tester comments
    * Program output
    * Prerequisites
    * Environment and other context

------------------------------
TESTER COMMENTS
------------------------------

Additional comments from tester:

none provided

------------------------------
PROGRAM OUTPUT
------------------------------

Output from './Build':

# cmake -S /home/cpansand/.cpan/build/2022102203/Alien-CSFML-v0.0.7-1/cmake/sfml -B ./build/sfml -DCMAKE_INSTALL_PREFIX=/home/cpansand/.cpan/build/2022102203/Alien-CSFML-v0.0.7-1/share/sfml -DCMAKE_BUILD_TYPE=Release -DBUILD_SHARED_LIBS=TRUE -DSFML_BUILD_EXAMPLES=FALSE -DSFML_BUILD_TEST_SUITE=FALSE
-- The CXX compiler identification is GNU 4.8.5
-- Detecting CXX compiler ABI info
-- Detecting CXX compiler ABI info - done
-- Check for working CXX compiler: /usr/bin/c++ - skipped
-- Detecting CXX compile features
-- Detecting CXX compile features - done
[ 11%] Creating directories for 'sfml-populate'
[ 22%] Performing download step (git clone) for 'sfml-populate'
Cloning into 'sfml-src'...
Branch 2.6.x set up to track remote branch 2.6.x from origin.
Switched to a new branch '2.6.x'
[ 33%] Performing update step for 'sfml-populate'
warning: CRLF will be replaced by LF in tools/xcode/templates/SFML/SFML App.xctemplate/tuffy.ttf.
The file will have its original line endings in your working directory.
warning: CRLF will be replaced by LF in tools/xcode/templates/SFML/SFML CLT.xctemplate/tuffy.ttf.
The file will have its original line endings in your working directory.
warning: CRLF will be replaced by LF in tools/xcode/templates/SFML/SFML App.xctemplate/tuffy.ttf.
The file will have its original line endings in your working directory.
warning: CRLF will be replaced by LF in tools/xcode/templates/SFML/SFML CLT.xctemplate/tuffy.ttf.
The file will have its original line endings in your working directory.
No rebase in progress?
error: Your local changes to the following files would be overwritten by merge:
	tools/xcode/templates/SFML/SFML App.xctemplate/tuffy.ttf
	tools/xcode/templates/SFML/SFML CLT.xctemplate/tuffy.ttf
Please, commit your changes or stash them before you can merge.
Aborting
Index was not unstashed.
CMake Error at /var/tmp/cpansmoker-1023/2022102203/jHIazX3D0Z/build/sfml/_deps/sfml-subbuild/sfml-populate-prefix/tmp/sfml-populate-gitupdate.cmake:203 (message):
  

  Failed to rebase in:
  '/var/tmp/cpansmoker-1023/2022102203/jHIazX3D0Z/build/sfml/_deps/sfml-src'.


  Output from the attempted rebase follows:

  Cannot rebase: You have unstaged changes.

  Please commit or stash them.

  

  

  You will have to resolve the conflicts manually


gmake[2]: *** [sfml-populate-prefix/src/sfml-populate-stamp/sfml-populate-update] Error 1
gmake[1]: *** [CMakeFiles/sfml-populate.dir/all] Error 2
gmake: *** [all] Error 2

CMake Error at /opt/perl-5.30.3/lib/site_perl/5.30.3/x86_64-linux/auto/share/dist/Alien-cmake3/share/cmake-3.24/Modules/FetchContent.cmake:1604 (message):
  Build step for sfml failed: 2
Call Stack (most recent call first):
  /opt/perl-5.30.3/lib/site_perl/5.30.3/x86_64-linux/auto/share/dist/Alien-cmake3/share/cmake-3.24/Modules/FetchContent.cmake:1744:EVAL:2 (__FetchContent_directPopulate)
  /opt/perl-5.30.3/lib/site_perl/5.30.3/x86_64-linux/auto/share/dist/Alien-cmake3/share/cmake-3.24/Modules/FetchContent.cmake:1744 (cmake_language)
  /opt/perl-5.30.3/lib/site_perl/5.30.3/x86_64-linux/auto/share/dist/Alien-cmake3/share/cmake-3.24/Modules/FetchContent.cmake:1958 (FetchContent_Populate)
  CMakeLists.txt:11 (FetchContent_MakeAvailable)


-- Configuring incomplete, errors occurred!
See also "/var/tmp/cpansmoker-1023/2022102203/jHIazX3D0Z/build/sfml/CMakeFiles/CMakeOutput.log".
system failed: 256 at inc/MBCSFML.pm line 172.

------------------------------
PREREQUISITES
------------------------------

Prerequisite modules loaded:

requires:

    Module                 Need     Have    
    ---------------------- -------- --------
    File::ShareDir         0        1.118   
    File::Slurp            0        9999.32 
    File::Spec::Functions  0        3.78    
    JSON::Tiny             0        0.58    
    perl                   5.026000 5.030003

build_requires:

    Module                 Need     Have    
    ---------------------- -------- --------
    Alien::cmake3          0        0.08    
    Alien::git             0        0.10    
    Archive::Extract       0        0.88    
    File::Copy             0        2.34    
    File::Copy::Recursive  0        0.45    
    File::pushd            0        1.016   
    File::ShareDir         0        1.118   
    File::Slurp            0        9999.32 
    File::Spec::Functions  0        3.78    
    HTTP::Tiny             0        0.076   
    JSON::Tiny             0        0.58    
    Test::More             0.98     1.302191

configure_requires:

    Module                 Need     Have    
    ---------------------- -------- --------
    Archive::Extract       0        0.88    
    CPAN::Meta             0        2.150010
    Devel::CheckBin        0        0.04    
    Exporter               5.57     5.74    
    ExtUtils::CBuilder     0        0.280231
    ExtUtils::Config       0.003    0.008   
    ExtUtils::Helpers      0.020    0.026   
    ExtUtils::Install      0        2.14    
    ExtUtils::InstallPaths 0.002    0.012   
    ExtUtils::ParseXS      0        3.40    
    File::Basename         0        2.85    
    File::Copy             0        2.34    
    File::Copy::Recursive  0        0.45    
    File::Find             0        1.36    
    File::Path             0        2.16    
    File::pushd            0        1.016   
    File::ShareDir         0        1.118   
    File::Slurp            0        9999.32 
    File::Spec::Functions  0        3.78    
    Getopt::Long           0        2.52    
    HTTP::Tiny             0        0.076   
    JSON::Tiny             0        0.58    
    Module::Build::Tiny    0.035    0.039   
    Pod::Man               0        4.11    
    TAP::Harness           0        3.42    


------------------------------
ENVIRONMENT AND OTHER CONTEXT
------------------------------

Environment variables:

    LANG = en_US.UTF-8
    PATH = /usr/local/bin:/usr/bin:/bin:/usr/local/sbin:/usr/sbin:/sbin:/home/cpansand/bin/linux-gnu:/home/cpansand/bin/sh:/home/cpansand/bin:/usr/games:/home/cpansand/devel:/home/eserte/src/srezic-misc/scripts
    PERL = /opt/perl-5.30.3/bin/perl
    PERL5LIB = /home/cpansand/.cpan/build/2022102203/Alien-Build-Git-0.10-1/blib/arch:/home/cpansand/.cpan/build/2022102203/Alien-Build-Git-0.10-1/blib/lib:/home/cpansand/.cpan/build/2022102203/URI-git-0.02-1/blib/arch:/home/cpansand/.cpan/build/2022102203/URI-git-0.02-1/blib/lib:/home/cpansand/.cpan/build/2022102203/Test2-Tools-URL-0.06-1/blib/arch:/home/cpansand/.cpan/build/2022102203/Test2-Tools-URL-0.06-1/blib/lib:/home/cpansand/.cpan/build/2022102203/JSON-Tiny-0.58-1/blib/arch:/home/cpansand/.cpan/build/2022102203/JSON-Tiny-0.58-1/blib/lib
    PERL5OPT = 
    PERL5_CPANPLUS_IS_RUNNING = 1191
    PERL5_CPAN_IS_RUNNING = 1191
    PERL5_CPAN_IS_RUNNING_IN_RECURSION = 32672,1191
    PERLDOC = -MPod::Perldoc::ToTextOverstrike
    PERL_BATCH = yes
    PERL_CANARY_STABILITY_NOPROMPT = 1
    PERL_CPAN_REPORTER_CONFIG = /var/tmp/cpansmoker-1023/2022102203/cpanreporter_000_config.ini
    PERL_EXTUTILS_AUTOINSTALL = --defaultdeps
    PERL_USE_UNSAFE_INC = 1
    SHELL = /usr/bin/zsh
    TERM = screen
    TMPDIR = /var/tmp/cpansmoker-1023/2022102203

Perl special variables (and OS-specific diagnostics, for MSWin32):

    $^X = /opt/perl-5.30.3/bin/perl
    $UID/$EUID = 1023 / 1023
    $GID = 1023 1023
    $EGID = 1023 1023

Perl module toolchain versions installed:

    Module              Have    
    ------------------- --------
    CPAN                2.22    
    CPAN::Meta          2.150010
    Cwd                 3.78    
    ExtUtils::CBuilder  0.280231
    ExtUtils::Command   7.64    
    ExtUtils::Install   2.14    
    ExtUtils::MakeMaker 7.64    
    ExtUtils::Manifest  1.72    
    ExtUtils::ParseXS   3.40    
    File::Spec          3.78    
    JSON                4.10    
    JSON::PP            4.12    
    Module::Build       0.4231  
    Module::Signature   n/a     
    Parse::CPAN::Meta   2.150010
    Test::Harness       3.42    
    Test::More          1.302191
    YAML                1.30    
    YAML::Syck          1.34    
    version             0.9924  


--

Summary of my perl5 (revision 5 version 30 subversion 3) configuration:
   
  Platform:
    osname=linux
    osvers=3.10.0-1160.76.1.el7.x86_64
    archname=x86_64-linux
    uname='linux cloud3.bbbike.org 3.10.0-1160.76.1.el7.x86_64 #1 smp wed aug 10 16:21:17 utc 2022 x86_64 x86_64 x86_64 gnulinux '
    config_args='-ds -e -Dprefix=/opt/perl-5.30.3 -Dcf_email=srezic@cpan.org'
    hint=recommended
    useposix=true
    d_sigaction=define
    useithreads=undef
    usemultiplicity=undef
    use64bitint=define
    use64bitall=define
    uselongdouble=undef
    usemymalloc=n
    default_inc_excludes_dot=define
    bincompat5005=undef
  Compiler:
    cc='cc'
    ccflags ='-fwrapv -fno-strict-aliasing -pipe -fstack-protector-strong -I/usr/local/include -D_LARGEFILE_SOURCE -D_FILE_OFFSET_BITS=64 -D_FORTIFY_SOURCE=2'
    optimize='-O2'
    cppflags='-fwrapv -fno-strict-aliasing -pipe -fstack-protector-strong -I/usr/local/include'
    ccversion=''
    gccversion='4.8.5 20150623 (Red Hat 4.8.5-44)'
    gccosandvers=''
    intsize=4
    longsize=8
    ptrsize=8
    doublesize=8
    byteorder=12345678
    doublekind=3
    d_longlong=define
    longlongsize=8
    d_longdbl=define
    longdblsize=16
    longdblkind=3
    ivtype='long'
    ivsize=8
    nvtype='double'
    nvsize=8
    Off_t='off_t'
    lseeksize=8
    alignbytes=8
    prototype=define
  Linker and Libraries:
    ld='cc'
    ldflags =' -fstack-protector-strong -L/usr/local/lib'
    libpth=/usr/local/lib /usr/lib /lib/../lib64 /usr/lib/../lib64 /lib /lib64 /usr/lib64 /usr/local/lib64
    libs=-lpthread -lnsl -lgdbm -ldb -ldl -lm -lcrypt -lutil -lc -lgdbm_compat
    perllibs=-lpthread -lnsl -ldl -lm -lcrypt -lutil -lc
    libc=libc-2.17.so
    so=so
    useshrplib=false
    libperl=libperl.a
    gnulibc_version='2.17'
  Dynamic Linking:
    dlsrc=dl_dlopen.xs
    dlext=so
    d_dlsymun=undef
    ccdlflags='-Wl,-E'
    cccdlflags='-fPIC'
    lddlflags='-shared -O2 -L/usr/local/lib -fstack-protector-strong'


Characteristics of this binary (from libperl): 
  Compile-time options:
    HAS_TIMES
    PERLIO_LAYERS
    PERL_COPY_ON_WRITE
    PERL_DONT_CREATE_GVSV
    PERL_MALLOC_WRAP
    PERL_OP_PARENT
    PERL_PRESERVE_IVUV
    USE_64_BIT_ALL
    USE_64_BIT_INT
    USE_LARGE_FILES
    USE_LOCALE
    USE_LOCALE_COLLATE
    USE_LOCALE_CTYPE
    USE_LOCALE_NUMERIC
    USE_LOCALE_TIME
    USE_PERLIO
    USE_PERL_ATOF
  Locally applied patches:
    Devel::PatchPerl 2.08
  Built under linux
  Compiled at Sep 23 2022 05:47:21
  %ENV:
    PERL="/opt/perl-5.30.3/bin/perl"
    PERL5LIB="/home/cpansand/.cpan/build/2022102203/Alien-Build-Git-0.10-1/blib/arch:/home/cpansand/.cpan/build/2022102203/Alien-Build-Git-0.10-1/blib/lib:/home/cpansand/.cpan/build/2022102203/URI-git-0.02-1/blib/arch:/home/cpansand/.cpan/build/2022102203/URI-git-0.02-1/blib/lib:/home/cpansand/.cpan/build/2022102203/Test2-Tools-URL-0.06-1/blib/arch:/home/cpansand/.cpan/build/2022102203/Test2-Tools-URL-0.06-1/blib/lib:/home/cpansand/.cpan/build/2022102203/JSON-Tiny-0.58-1/blib/arch:/home/cpansand/.cpan/build/2022102203/JSON-Tiny-0.58-1/blib/lib"
    PERL5OPT=""
    PERL5_CPANPLUS_IS_RUNNING="1191"
    PERL5_CPAN_IS_RUNNING="1191"
    PERL5_CPAN_IS_RUNNING_IN_RECURSION="32672,1191"
    PERLDOC="-MPod::Perldoc::ToTextOverstrike"
    PERL_BATCH="yes"
    PERL_CANARY_STABILITY_NOPROMPT="1"
    PERL_CPAN_REPORTER_CONFIG="/var/tmp/cpansmoker-1023/2022102203/cpanreporter_000_config.ini"
    PERL_EXTUTILS_AUTOINSTALL="--defaultdeps"
    PERL_USE_UNSAFE_INC="1"
  @INC:
    /home/cpansand/.cpan/build/2022102203/Alien-Build-Git-0.10-1/blib/arch
    /home/cpansand/.cpan/build/2022102203/Alien-Build-Git-0.10-1/blib/lib
    /home/cpansand/.cpan/build/2022102203/URI-git-0.02-1/blib/arch
    /home/cpansand/.cpan/build/2022102203/URI-git-0.02-1/blib/lib
    /home/cpansand/.cpan/build/2022102203/Test2-Tools-URL-0.06-1/blib/arch
    /home/cpansand/.cpan/build/2022102203/Test2-Tools-URL-0.06-1/blib/lib
    /home/cpansand/.cpan/build/2022102203/JSON-Tiny-0.58-1/blib/arch
    /home/cpansand/.cpan/build/2022102203/JSON-Tiny-0.58-1/blib/lib
    /opt/perl-5.30.3/lib/site_perl/5.30.3/x86_64-linux
    /opt/perl-5.30.3/lib/site_perl/5.30.3
    /opt/perl-5.30.3/lib/5.30.3/x86_64-linux
    /opt/perl-5.30.3/lib/5.30.3
    .