Padre-Plugin-PAR v0.06 Perl 5 v5.13.0 alpha-linux-thread-multi

Status
Unknown
From
Chris Williams (BINGOS)
Dist
Padre-Plugin-PAR v0.06
Platform
Perl 5 v5.13.0 alpha-linux-thread-multi
Date
2010-08-15T04:22:22
ID
b35fa968-a824-11df-8246-59ba6e8696e0
This distribution has been tested as part of the CPAN Testers
project, supporting the Perl programming language.  See
http://wiki.cpantesters.org/ for more information or email
questions to cpan-testers-discuss@perl.org


--

Dear CHORNY,
    
This is a computer-generated error report created automatically by
CPANPLUS, version 0.9007. Testers personal comments may appear 
at the end of this report.


Thank you for uploading your work to CPAN.  However, it appears that
there were some problems testing your distribution.

TEST RESULTS:

Below is the error stack from stage 'fetch':

[ERROR] [Sun Aug 15 05:22:11 2010] MAKE failed: Inappropriate ioctl for device make[1]: Entering directory `/home/cpan/pit/rel/conf/perl-5.13.0/.cpanplus/5.13.0/build/Wx-0.9702/ext'
make[2]: Entering directory `/home/cpan/pit/rel/conf/perl-5.13.0/.cpanplus/5.13.0/build/Wx-0.9702/ext/richtext'
g++ -pthread   -c  -I. -I../.. -I/home/cpan/pit/rel/perl-5.13.0/lib/site_perl/5.13.0/alpha-linux-thread-multi/Alien/wxWidgets/gtk_2_8_10_uni/lib/wx/include/gtk2-unicode-release-2.8 -I/home/cpan/pit/rel/perl-5.13.0/lib/site_perl/5.13.0/alpha-linux-thread-multi/Alien/wxWidgets/gtk_2_8_10_uni/include/wx-2.8  -D_REENTRANT -D_GNU_SOURCE -fno-strict-aliasing -pipe -I/usr/local/include -D_LARGEFILE_SOURCE -D_FILE_OFFSET_BITS=64 -O2   -DVERSION=\"0.01\" -DXS_VERSION=\"0.01\" -fPIC "-I/home/cpan/pit/rel/perl-5.13.0/lib/5.13.0/alpha-linux-thread-multi/CORE"  -DWXPL_EXT -D_FILE_OFFSET_BITS=64 -D_LARGE_FILES -D__WXGTK__   RichText.c
In file included from RichText.c:23:
../../cpp/wxapi.h:25:21: error: wx/defs.h: No such file or directory
../../cpp/wxapi.h:31:2: error: #error wxWidgets 2.4.x, 2.5.0, 2.5.1, 2.5.2, 2.7.0, 2.7.1 are no longer supported by wxPerl
In file included from ../../cpp/wxapi.h:38,
                 from RichText.c:23:
../../cpp/chkconfig.h:14:22: error: wx/setup.h: No such file or directory
In file included from ../../cpp/wxapi.h:144,
                 from RichText.c:23:
../../cpp/helpers.h:16:23: error: wx/object.h: No such file or directory
../../cpp/helpers.h:17:21: error: wx/list.h: No such file or directory
../../cpp/helpers.h:18:23: error: wx/gdicmn.h: No such file or directory
../../cpp/helpers.h:19:24: error: wx/variant.h: No such file or directory
../../cpp/helpers.h:21:25: error: wx/dynarray.h: No such file or directory
../../cpp/helpers.h:22:23: error: wx/arrstr.h: No such file or directory
RichText.c:32:38: error: wx/richtext/richtextctrl.h: No such file or directory
RichText.c:126:22: error: wx/event.h: No such file or directory
RichText.c:127:23: error: wx/button.h: No such file or directory
RichText.c:128:25: error: wx/checkbox.h: No such file or directory
RichText.c:130:40: error: wx/richtext/richtextstyles.h: No such file or directory
RichText.c:131:43: error: wx/richtext/richtextformatdlg.h: No such file or directory
RichText.c:132:42: error: wx/richtext/richtextstyledlg.h: No such file or directory
RichText.c:133:39: error: wx/richtext/richtextprint.h: No such file or directory
RichText.c:5294:40: error: wx/richtext/richtextbuffer.h: No such file or directory
RichText.c:13666:25: error: wx/imaglist.h: No such file or directory
In file included from cpp/filehandler.h:8,
                 from RichText.c:14317:
../../cpp/streams.h:17:23: error: wx/stream.h: No such file or directory
RichText.c:14880:37: error: wx/richtext/richtextxml.h: No such file or directory
RichText.c:17505:43: error: wx/richtext/richtextsymboldlg.h: No such file or directory
In file included from ../../cpp/compat.h:14,
                 from ../../cpp/wxapi.h:27,
                 from RichText.c:23:
/home/cpan/pit/rel/perl-5.13.0/lib/5.13.0/alpha-linux-thread-multi/CORE/patchlevel.h:131: error: ‘NULL’ was not declared in this scope
/home/cpan/pit/rel/perl-5.13.0/lib/5.13.0/alpha-linux-thread-multi/CORE/patchlevel.h:136: error: ‘NULL’ was not declared in this scope
In file included from ../../cpp/wxapi.h:144,
                 from RichText.c:23:
../../cpp/helpers.h:33: error: aggregate ‘WXDLLEXPORT wxInputStream’ has incomplete type and cannot be defined
../../cpp/helpers.h:34: error: aggregate ‘WXDLLEXPORT wxOutputStream’ has incomplete type and cannot be defined
../../cpp/helpers.h:35: error: aggregate ‘WXDLLEXPORT wxEvtHandler’ has incomplete type and cannot be defined
../../cpp/helpers.h:36: error: aggregate ‘WXDLLEXPORT wxClientDataContainer’ has incomplete type and cannot be defined
../../cpp/helpers.h:37: error: aggregate ‘WXDLLEXPORT wxPoint2DDouble’ has incomplete type and cannot be defined
../../cpp/helpers.h:38: error: ‘wxInputStream’ does not name a type
../../cpp/helpers.h:39: error: ‘wxOutputStream’ does not name a type
../../cpp/helpers.h:49: error: expected ‘,’ or ‘...’ before ‘*’ token
../../cpp/helpers.h:49: error: ISO C++ forbids declaration of ‘wxChar’ with no type
../../cpp/helpers.h:50: error: expected ‘,’ or ‘...’ before ‘&’ token
../../cpp/helpers.h:50: error: ISO C++ forbids declaration of ‘wxString’ with no type
../../cpp/helpers.h:130: error: expected ‘,’ or ‘...’ before ‘*’ token
../../cpp/helpers.h:130: error: ISO C++ forbids declaration of ‘wxChar’ with no type
../../cpp/helpers.h: In function ‘SV* wxPli_wxChar_2_sv(PerlInterpreter*, int)’:
../../cpp/helpers.h:138: error: ‘out’ was not declared in this scope
../../cpp/helpers.h:138: error: ‘wxConvUTF8’ was not declared in this scope
../../cpp/helpers.h:138: error: ‘wxConvLibc’ was not declared in this scope
../../cpp/helpers.h:138: error: ‘str’ was not declared in this scope
../../cpp/helpers.h:138: error: ‘wxEmptyString’ was not declared in this scope
../../cpp/helpers.h:143: error: ‘out’ was not declared in this scope
../../cpp/helpers.h:143: error: ‘str’ was not declared in this scope
../../cpp/helpers.h:146: error: ‘out’ was not declared in this scope
../../cpp/helpers.h: At global scope:
../../cpp/helpers.h:149: error: expected ‘,’ or ‘...’ before ‘&’ token
../../cpp/helpers.h:149: error: ISO C++ forbids declaration of ‘wxString’ with no type
../../cpp/helpers.h: In function ‘SV* wxPli_wxString_2_sv(PerlInterpreter*, int)’:
../../cpp/helpers.h:157: error: ‘out’ was not declared in this scope
../../cpp/helpers.h:157: error: ‘wxConvUTF8’ was not declared in this scope
../../cpp/helpers.h:157: error: ‘wxConvLibc’ was not declared in this scope
../../cpp/helpers.h:157: error: ‘str’ was not declared in this scope
../../cpp/helpers.h:162: error: ‘out’ was not declared in this scope
../../cpp/helpers.h:162: error: ‘str’ was not declared in this scope
../../cpp/helpers.h:165: error: ‘out’ was not declared in this scope
../../cpp/helpers.h: At global scope:
../../cpp/helpers.h:187: error: ‘wxString’ does not name a type
../../cpp/helpers.h:216: error: expected ‘,’ or ‘...’ before ‘*’ token
../../cpp/helpers.h:217: error: ISO C++ forbids declaration of ‘wxChar’ with no type
../../cpp/helpers.h:242: error: expected ‘,’ or ‘...’ before ‘*’ token
../../cpp/helpers.h:242: error: ISO C++ forbids declaration of ‘wxObject’ with no type
../../cpp/helpers.h:244: error: ‘wxClientDataContainer’ is not a type
../../cpp/helpers.h:246: error: ‘wxEvtHandler’ is not a type
../../cpp/helpers.h:251: error: ‘wxEvtHandler’ is not a type
../../cpp/helpers.h:264: error: expected constructor, destructor, or type conversion before ‘(’ token
../../cpp/helpers.h:265: error: ‘wxString’ has not been declared
../../cpp/helpers.h:267: error: ‘wxChar’ has not been declared
../../cpp/helpers.h:272: error: ‘wxArrayString’ has not been declared
../../cpp/helpers.h:273: error: ‘wxArrayInt’ has not been declared
../../cpp/helpers.h:294: error: expected ‘,’ or ‘...’ before ‘&’ token
../../cpp/helpers.h:294: error: ISO C++ forbids declaration of ‘wxArrayString’ with no type
../../cpp/helpers.h:295: error: expected ‘,’ or ‘...’ before ‘&’ token
../../cpp/helpers.h:295: error: ISO C++ forbids declaration of ‘wxArrayInt’ with no type
../../cpp/helpers.h:299: error: expected ‘,’ or ‘...’ before ‘&’ token
../../cpp/helpers.h:299: error: ISO C++ forbids declaration of ‘wxArrayString’ with no type
../../cpp/helpers.h:301: error: expected ‘,’ or ‘...’ before ‘&’ token
../../cpp/helpers.h:301: error: ISO C++ forbids declaration of ‘wxList’ with no type
../../cpp/helpers.h:302: error: expected ‘,’ or ‘...’ before ‘&’ token
../../cpp/helpers.h:302: error: ISO C++ forbids declaration of ‘wxList’ with no type
../../cpp/helpers.h:325: error: expected constructor, destructor, or type conversion before ‘(’ token
../../cpp/helpers.h:326: error: expected constructor, destructor, or type conversion before ‘(’ token
../../cpp/helpers.h:327: error: expected constructor, destructor, or type conversion before ‘(’ token
../../cpp/helpers.h:339: error: ‘wxKeyCode’ does not name a type
../../cpp/helpers.h:344: error: ‘wxList’ has not been declared
../../cpp/helpers.h:344: error: ‘wxPoint’ has not been declared
../../cpp/helpers.h:346: error: ‘wxPoint’ has not been declared
../../cpp/helpers.h:347: error: ‘wxPoint2DDouble’ is not a type
../../cpp/helpers.h:468: error: ‘wxEvtHandler’ is not a type
../../cpp/helpers.h:469: error: expected ‘,’ or ‘...’ before ‘*’ token
../../cpp/helpers.h:469: error: ISO C++ forbids declaration of ‘wxObject’ with no type
../../cpp/helpers.h:472: error: expected identifier before ‘*’ token
../../cpp/helpers.h:472: error: ISO C++ forbids declaration of ‘wxPoint’ with no type
../../cpp/helpers.h:472: error: ‘wxPoint’ declared as function returning a function
../../cpp/helpers.h:473: error: expected identifier before ‘*’ token
../../cpp/helpers.h:473: error: ISO C++ forbids declaration of ‘wxPoint’ with no type
../../cpp/helpers.h:473: error: ‘wxPoint’ declared as function returning a function
../../cpp/helpers.h:473: error: ‘int wxPliHelpers::wxPoint(int*)’ cannot be overloaded
../../cpp/helpers.h:472: error: with ‘int wxPliHelpers::wxPoint(int*)’
../../cpp/helpers.h:474: error: expected identifier before ‘*’ token
../../cpp/helpers.h:474: error: ISO C++ forbids declaration of ‘wxSize’ with no type
../../cpp/helpers.h:474: error: ‘wxSize’ declared as function returning a function
../../cpp/helpers.h:492: error: expected identifier before ‘*’ token
../../cpp/helpers.h:492: error: ISO C++ forbids declaration of ‘wxWindowID’ with no type
../../cpp/helpers.h:492: error: ‘wxWindowID’ declared as function returning a function
../../cpp/helpers.h:493: error: ‘wxString’ has not been declared
../../cpp/helpers.h:495: error: expected ‘,’ or ‘...’ before ‘*’ token
../../cpp/helpers.h:496: error: ISO C++ forbids declaration of ‘wxChar’ with no type
../../cpp/helpers.h:501: error: ‘wxEvtHandler’ is not a type
../../cpp/helpers.h:506: error: expected ‘,’ or ‘...’ before ‘&’ token
../../cpp/helpers.h:506: error: ISO C++ forbids declaration of ‘wxList’ with no type
../../cpp/helpers.h:507: error: expected ‘,’ or ‘...’ before ‘&’ token
../../cpp/helpers.h:507: error: ISO C++ forbids declaration of ‘wxArrayInt’ with no type
../../cpp/helpers.h:509: error: ‘wxClientDataContainer’ is not a type
../../cpp/helpers.h:522: error: ‘wxArrayInt’ has not been declared
../../cpp/helpers.h:524: error: ‘wxArrayString’ has not been declared
../../cpp/helpers.h:525: error: expected ‘,’ or ‘...’ before ‘&’ token
../../cpp/helpers.h:525: error: ISO C++ forbids declaration of ‘wxList’ with no type
../../cpp/helpers.h:527: error: expected ‘,’ or ‘...’ before ‘&’ token
../../cpp/helpers.h:527: error: ISO C++ forbids declaration of ‘wxArrayString’ with no type
../../cpp/helpers.h:623: error: expected initializer before ‘ListCtrlCompareFn’
../../cpp/helpers.h:626: error: expected class-name before ‘{’ token
../../cpp/helpers.h:667: error: typedef ‘wxPliGetCallbackObjectFn’ is initialized (use __typeof__ instead)
../../cpp/helpers.h:667: error: ‘wxObject’ was not declared in this scope
../../cpp/helpers.h:667: error: ‘object’ was not declared in this scope
../../cpp/helpers.h:670: error: expected class-name before ‘{’ token
../../cpp/helpers.h:683: error: expected `)' before ‘*’ token
../../cpp/helpers.h:693: error: ‘wxPliGetCallbackObjectFn’ does not name a type
RichText.c:45: error: ‘wxEVT_COMMAND_RICHTEXT_ITEM_SELECTED’ was not declared in this scope
RichText.c:46: error: ‘wxEVT_COMMAND_RICHTEXT_ITEM_DESELECTED’ was not declared in this scope
RichText.c:48: error: ‘wxEVT_COMMAND_RICHTEXT_LEFT_CLICK’ was not declared in this scope
RichText.c:49: error: ‘wxEVT_COMMAND_RICHTEXT_RIGHT_CLICK’ was not declared in this scope
RichText.c:50: error: ‘wxEVT_COMMAND_RICHTEXT_MIDDLE_CLICK’ was not declared in this scope
RichText.c:51: error: ‘wxEVT_COMMAND_RICHTEXT_LEFT_DCLICK’ was not declared in this scope
RichText.c:52: error: ‘wxEVT_COMMAND_RICHTEXT_RETURN’ was not declared in this scope
In file included from RichText.c:134:
cpp/richtextctrl.h: In function ‘double richtextctrl_constant(const char*, int)’:
cpp/richtextctrl.h:28: error: ‘wxRE_READONLY’ was not declared in this scope
cpp/richtextctrl.h:29: error: ‘wxRE_MULTILINE’ was not declared in this scope
cpp/richtextctrl.h:49: error: ‘wxRICHTEXT_FIXED_WIDTH’ was not declared in this scope
cpp/richtextctrl.h:50: error: ‘wxRICHTEXT_FIXED_HEIGHT’ was not declared in this scope
cpp/richtextctrl.h:51: error: ‘wxRICHTEXT_VARIABLE_WIDTH’ was not declared in this scope
cpp/richtextctrl.h:52: error: ‘wxRICHTEXT_VARIABLE_HEIGHT’ was not declared in this scope
cpp/richtextctrl.h:53: error: ‘wxRICHTEXT_LAYOUT_SPECIFIED_RECT’ was not declared in this scope
cpp/richtextctrl.h:57: error: ‘wxRICHTEXT_HITTEST_NONE’ was not declared in this scope
cpp/richtextctrl.h:58: error: ‘wxRICHTEXT_HITTEST_BEFORE’ was not declared in this scope
cpp/richtextctrl.h:59: error: ‘wxRICHTEXT_HITTEST_AFTER’ was not declared in this scope
cpp/richtextctrl.h:60: error: ‘wxRICHTEXT_HITTEST_ON’ was not declared in this scope
cpp/richtextctrl.h:64: error: ‘wxRICHTEXT_HANDLER_INCLUDE_STYLESHEET’ was not declared in this scope
cpp/richtextctrl.h:65: error: ‘wxRICHTEXT_HANDLER_SAVE_IMAGES_TO_MEMORY’ was not declared in this scope
cpp/richtextctrl.h:66: error: ‘wxRICHTEXT_HANDLER_SAVE_IMAGES_TO_FILES’ was not declared in this scope
cpp/richtextctrl.h:67: error: ‘wxRICHTEXT_HANDLER_SAVE_IMAGES_TO_BASE64’ was not declared in this scope
cpp/richtextctrl.h:75: error: ‘wxRICHTEXT_FORMATTED’ was not declared in this scope
cpp/richtextctrl.h:76: error: ‘wxRICHTEXT_UNFORMATTED’ was not declared in this scope
cpp/richtextctrl.h:77: error: ‘wxRICHTEXT_TYPE_ANY’ was not declared in this scope
cpp/richtextctrl.h:78: error: ‘wxRICHTEXT_TYPE_TEXT’ was not declared in this scope
cpp/richtextctrl.h:79: error: ‘wxRICHTEXT_TYPE_XML’ was not declared in this scope
cpp/richtextctrl.h:80: error: ‘wxRICHTEXT_TYPE_HTML’ was not declared in this scope
cpp/richtextctrl.h:81: error: ‘wxRICHTEXT_TYPE_RTF’ was not declared in this scope
cpp/richtextctrl.h:82: error: ‘wxRICHTEXT_TYPE_PDF’ was not declared in this scope
cpp/richtextctrl.h:83: error: ‘wxRICHTEXT_FORMAT_STYLE_EDITOR’ was not declared in this scope
cpp/richtextctrl.h:84: error: ‘wxRICHTEXT_FORMAT_FONT’ was not declared in this scope
cpp/richtextctrl.h:85: error: ‘wxRICHTEXT_FORMAT_TABS’ was not declared in this scope
cpp/richtextctrl.h:86: error: ‘wxRICHTEXT_FORMAT_BULLETS’ was not declared in this scope
cpp/richtextctrl.h:87: error: ‘wxRICHTEXT_FORMAT_INDENTS_SPACING’ was not declared in this scope
cpp/richtextctrl.h:88: error: ‘wxRICHTEXT_FORMAT_CHARACTER’ was not declared in this scope
cpp/richtextctrl.h:89: error: ‘wxRICHTEXT_FORMAT_HELP_BUTTON’ was not declared in this scope
cpp/richtextctrl.h:90: error: ‘wxRICHTEXT_FORMAT_LIST_STYLE’ was not declared in this scope
cpp/richtextctrl.h:91: error: ‘wxRICHTEXT_FORMAT_PARAGRAPH’ was not declared in this scope
cpp/richtextctrl.h:92: error: ‘wxRICHTEXT_FORMAT_STYLE’ was not declared in this scope
cpp/richtextctrl.h:94: error: ‘wxRICHTEXT_ORGANISER_DELETE_STYLES’ was not declared in this scope
cpp/richtextctrl.h:95: error: ‘wxRICHTEXT_ORGANISER_CREATE_STYLES’ was not declared in this scope
cpp/richtextctrl.h:96: error: ‘wxRICHTEXT_ORGANISER_APPLY_STYLES’ was not declared in this scope
cpp/richtextctrl.h:97: error: ‘wxRICHTEXT_ORGANISER_EDIT_STYLES’ was not declared in this scope
cpp/richtextctrl.h:98: error: ‘wxRICHTEXT_ORGANISER_RENAME_STYLES’ was not declared in this scope
cpp/richtextctrl.h:99: error: ‘wxRICHTEXT_ORGANISER_OK_CANCEL’ was not declared in this scope
cpp/richtextctrl.h:100: error: ‘wxRICHTEXT_ORGANISER_RENUMBER’ was not declared in this scope
cpp/richtextctrl.h:101: error: ‘wxRICHTEXT_ORGANISER_SHOW_CHARACTER’ was not declared in this scope
cpp/richtextctrl.h:102: error: ‘wxRICHTEXT_ORGANISER_SHOW_PARAGRAPH’ was not declared in this scope
cpp/richtextctrl.h:103: error: ‘wxRICHTEXT_ORGANISER_SHOW_LIST’ was not declared in this scope
cpp/richtextctrl.h:104: error: ‘wxRICHTEXT_ORGANISER_SHOW_ALL’ was not declared in this scope
cpp/richtextctrl.h:105: error: ‘wxRICHTEXT_ORGANISER_ORGANISE’ was not declared in this scope
cpp/richtextctrl.h:106: error: ‘wxRICHTEXT_ORGANISER_BROWSE’ was not declared in this scope
cpp/richtextctrl.h:107: error: ‘wxRICHTEXT_ORGANISER_BROWSE_NUMBERING’ was not declared in this scope
cpp/richtextctrl.h:109: error: ‘wxRICHTEXT_PAGE_ALL’ was not declared in this scope
cpp/richtextctrl.h:110: error: ‘wxRICHTEXT_PAGE_CENTRE’ was not declared in this scope
cpp/richtextctrl.h:111: error: ‘wxRICHTEXT_PAGE_EVEN’ was not declared in this scope
cpp/richtextctrl.h:112: error: ‘wxRICHTEXT_PAGE_LEFT’ was not declared in this scope
cpp/richtextctrl.h:113: error: ‘wxRICHTEXT_PAGE_ODD’ was not declared in this scope
cpp/richtextctrl.h:114: error: ‘wxRICHTEXT_PAGE_RIGHT’ was not declared in this scope
cpp/richtextctrl.h:116: error: ‘wxRichTextStyleListBox’ has not been declared
cpp/richtextctrl.h:117: error: ‘wxRichTextStyleListBox’ has not been declared
cpp/richtextctrl.h:118: error: ‘wxRichTextStyleListBox’ has not been declared
cpp/richtextctrl.h:119: error: ‘wxRichTextStyleListBox’ has not been declared
cpp/richtextctrl.h:122: error: ‘wxTEXT_ATTR_PARA_SPACING_AFTER’ was not declared in this scope
cpp/richtextctrl.h:123: error: ‘wxTEXT_ATTR_PARA_SPACING_BEFORE’ was not declared in this scope
cpp/richtextctrl.h:124: error: ‘wxTEXT_ATTR_LINE_SPACING’ was not declared in this scope
cpp/richtextctrl.h:125: error: ‘wxTEXT_ATTR_CHARACTER_STYLE_NAME’ was not declared in this scope
cpp/richtextctrl.h:126: error: ‘wxTEXT_ATTR_PARAGRAPH_STYLE_NAME’ was not declared in this scope
cpp/richtextctrl.h:130: error: ‘wxTEXT_ATTR_BULLET_STYLE’ was not declared in this scope
cpp/richtextctrl.h:131: error: ‘wxTEXT_ATTR_BULLET_NUMBER’ was not declared in this scope
cpp/richtextctrl.h:138: error: ‘wxTEXT_ATTR_BULLET_STYLE_NONE’ was not declared in this scope
cpp/richtextctrl.h:139: error: ‘wxTEXT_ATTR_BULLET_STYLE_ARABIC’ was not declared in this scope
cpp/richtextctrl.h:140: error: ‘wxTEXT_ATTR_BULLET_STYLE_LETTERS_UPPER’ was not declared in this scope
cpp/richtextctrl.h:141: error: ‘wxTEXT_ATTR_BULLET_STYLE_LETTERS_LOWER’ was not declared in this scope
cpp/richtextctrl.h:142: error: ‘wxTEXT_ATTR_BULLET_STYLE_ROMAN_UPPER’ was not declared in this scope
cpp/richtextctrl.h:143: error: ‘wxTEXT_ATTR_BULLET_STYLE_ROMAN_LOWER’ was not declared in this scope
cpp/richtextctrl.h:144: error: ‘wxTEXT_ATTR_BULLET_STYLE_SYMBOL’ was not declared in this scope
cpp/richtextctrl.h:145: error: ‘wxTEXT_ATTR_BULLET_STYLE_BITMAP’ was not declared in this scope
cpp/richtextctrl.h:146: error: ‘wxTEXT_ATTR_BULLET_STYLE_PARENTHESES’ was not declared in this scope
cpp/richtextctrl.h:147: error: ‘wxTEXT_ATTR_BULLET_STYLE_PERIOD’ was not declared in this scope
cpp/richtextctrl.h:156: error: ‘wxTEXT_ATTR_LINE_SPACING_NORMAL’ was not declared in this scope
cpp/richtextctrl.h:157: error: ‘wxTEXT_ATTR_LINE_SPACING_HALF’ was not declared in this scope
cpp/richtextctrl.h:158: error: ‘wxTEXT_ATTR_LINE_SPACING_TWICE’ was not declared in this scope
cpp/richtextctrl.h:159: error: ‘wxTEXT_ATTR_CHARACTER’ was not declared in this scope
cpp/richtextctrl.h:160: error: ‘wxTEXT_ATTR_PARAGRAPH’ was not declared in this scope
cpp/richtextctrl.h:161: error: ‘wxTEXT_ATTR_ALL’ was not declared in this scope
RichText.c: In function ‘void XS_Wx__RichTextEvent_GetIndex(PerlInterpreter*, CV*)’:
RichText.c:152: error: ‘wxRichTextEvent’ was not declared in this scope
RichText.c:152: error: ‘THIS’ was not declared in this scope
RichText.c:152: error: expected primary-expression before ‘)’ token
RichText.c:152: error: expected `;' before ‘wxPli_sv_2_object’
RichText.c: In function ‘void XS_Wx__RichTextEvent_SetIndex(PerlInterpreter*, CV*)’:
RichText.c:181: error: ‘wxRichTextEvent’ was not declared in this scope
RichText.c:181: error: ‘THIS’ was not declared in this scope
RichText.c:181: error: expected primary-expression before ‘)’ token
RichText.c:181: error: expected `;' before ‘wxPli_sv_2_object’
RichText.c: In function ‘void XS_Wx__RichTextEvent_GetFlags(PerlInterpreter*, CV*)’:
RichText.c:209: error: ‘wxRichTextEvent’ was not declared in this scope
RichText.c:209: error: ‘THIS’ was not declared in this scope
RichText.c:209: error: expected primary-expression before ‘)’ token
RichText.c:209: error: expected `;' before ‘wxPli_sv_2_object’
RichText.c: In function ‘void XS_Wx__RichTextEvent_SetFlags(PerlInterpreter*, CV*)’:
RichText.c:238: error: ‘wxRichTextEvent’ was not declared in this scope
RichText.c:238: error: ‘THIS’ was not declared in this scope
RichText.c:238: error: expected primary-expression before ‘)’ token
RichText.c:238: error: expected `;' before ‘wxPli_sv_2_object’
RichText.c: In function ‘void XS_Wx__RichTextCtrl_newDefault(PerlInterpreter*, CV*)’:
RichText.c:389: error: ‘wxRichTextCtrl’ was not declared in this scope
RichText.c:389: error: ‘RETVAL’ was not declared in this scope
RichText.c:390: error: expected type-specifier before ‘wxRichTextCtrl’
RichText.c:390: error: expected `;' before ‘wxRichTextCtrl’
RichText.c: In function ‘void XS_Wx__RichTextCtrl_newFull(PerlInterpreter*, CV*)’:
RichText.c:412: error: ‘wxRichTextCtrl’ was not declared in this scope
RichText.c:412: error: ‘RETVAL’ was not declared in this scope
RichText.c:413: error: ‘wxWindow’ was not declared in this scope
RichText.c:413: error: ‘parent’ was not declared in this scope
RichText.c:413: error: expected primary-expression before ‘)’ token
RichText.c:413: error: expected `;' before ‘wxPli_sv_2_object’
RichText.c:414: error: ‘wxWindowID’ was not declared in this scope
RichText.c:414: error: expected `;' before ‘id’
RichText.c:415: error: ‘wxString’ was not declared in this scope
RichText.c:415: error: expected `;' before ‘string’
RichText.c:416: error: ‘wxPoint’ was not declared in this scope
RichText.c:416: error: expected `;' before ‘pos’
RichText.c:417: error: ‘wxSize’ was not declared in this scope
RichText.c:417: error: expected `;' before ‘size’
RichText.c:421: error: ‘id’ was not declared in this scope
RichText.c:421: error: ‘wxID_ANY’ was not declared in this scope
RichText.c:423: error: ‘id’ was not declared in this scope
RichText.c:423: error: ‘wxPli_get_wxwindowid’ was not declared in this scope
RichText.c:427: error: ‘string’ was not declared in this scope
RichText.c:427: error: ‘wxEmptyString’ was not declared in this scope
RichText.c:429: error: ‘string’ was not declared in this scope
RichText.c:429: error: ‘wxConvUTF8’ was not declared in this scope
RichText.c:429: error: ‘wxConvLocal’ was not declared in this scope
RichText.c:433: error: ‘pos’ was not declared in this scope
RichText.c:433: error: ‘wxDefaultPosition’ was not declared in this scope
RichText.c:435: error: ‘pos’ was not declared in this scope
RichText.c:435: error: ‘wxPli_sv_2_wxpoint’ was not declared in this scope
RichText.c:439: error: ‘size’ was not declared in this scope
RichText.c:439: error: ‘wxDefaultSize’ was not declared in this scope
RichText.c:441: error: ‘size’ was not declared in this scope
RichText.c:441: error: ‘wxPli_sv_2_wxsize’ was not declared in this scope
RichText.c:445: error: ‘wxRE_MULTILINE’ was not declared in this scope
RichText.c:449: error: expected type-specifier before ‘wxRichTextCtrl’
RichText.c:449: error: expected `;' before ‘wxRichTextCtrl’
RichText.c: In function ‘void XS_Wx__RichTextCtrl_Create(PerlInterpreter*, CV*)’:
RichText.c:471: error: ‘wxRichTextCtrl’ was not declared in this scope
RichText.c:471: error: ‘THIS’ was not declared in this scope
RichText.c:471: error: expected primary-expression before ‘)’ token
RichText.c:471: error: expected `;' before ‘wxPli_sv_2_object’
RichText.c:473: error: ‘wxWindow’ was not declared in this scope
RichText.c:473: error: ‘parent’ was not declared in this scope
RichText.c:473: error: expected primary-expression before ‘)’ token
RichText.c:473: error: expected `;' before ‘wxPli_sv_2_object’
RichText.c:474: error: ‘wxWindowID’ was not declared in this scope
RichText.c:474: error: expected `;' before ‘id’
RichText.c:475: error: ‘wxString’ was not declared in this scope
RichText.c:475: error: expected `;' before ‘string’
RichText.c:476: error: ‘wxPoint’ was not declared in this scope
RichText.c:476: error: expected `;' before ‘pos’
RichText.c:477: error: ‘wxSize’ was not declared in this scope
RichText.c:477: error: expected `;' before ‘size’
RichText.c:481: error: ‘id’ was not declared in this scope
RichText.c:481: error: ‘wxID_ANY’ was not declared in this scope
RichText.c:483: error: ‘id’ was not declared in this scope
RichText.c:483: error: ‘wxPli_get_wxwindowid’ was not declared in this scope
RichText.c:487: error: ‘string’ was not declared in this scope
RichText.c:487: error: ‘wxEmptyString’ was not declared in this scope
RichText.c:489: error: ‘string’ was not declared in this scope
RichText.c:489: error: ‘wxConvUTF8’ was not declared in this scope
RichText.c:489: error: ‘wxConvLocal’ was not declared in this scope
RichText.c:493: error: ‘pos’ was not declared in this scope
RichText.c:493: error: ‘wxDefaultPosition’ was not declared in this scope
RichText.c:495: error: ‘pos’ was not declared in this scope
RichText.c:495: error: ‘wxPli_sv_2_wxpoint’ was not declared in this scope
RichText.c:499: error: ‘size’ was not declared in this scope
RichText.c:499: error: ‘wxDefaultSize’ was not declared in this scope
RichText.c:501: error: ‘size’ was not declared in this scope
RichText.c:501: error: ‘wxPli_sv_2_wxsize’ was not declared in this scope
RichText.c:505: error: ‘wxRE_MULTILINE’ was not declared in this scope
RichText.c:510: error: ‘id’ was not declared in this scope
RichText.c:510: error: ‘string’ was not declared in this scope
RichText.c:510: error: ‘pos’ was not declared in this scope
RichText.c:510: error: ‘size’ was not declared in this scope
RichText.c: In function ‘void XS_Wx__RichTextCtrl_GetFilename(PerlInterpreter*, CV*)’:
RichText.c:536: error: ‘wxRichTextCtrl’ was not declared in this scope
RichText.c:536: error: ‘THIS’ was not declared in this scope
RichText.c:536: error: expected primary-expression before ‘)’ token
RichText.c:536: error: expected `;' before ‘wxPli_sv_2_object’
RichText.c:537: error: ‘wxString’ was not declared in this scope
RichText.c:537: error: expected `;' before ‘RETVAL’
RichText.c:539: error: ‘RETVAL’ was not declared in this scope
RichText.c:548: error: ‘RETVAL’ was not declared in this scope
RichText.c: In function ‘void XS_Wx__RichTextCtrl_SetFilename(PerlInterpreter*, CV*)’:
RichText.c:566: error: ‘wxRichTextCtrl’ was not declared in this scope
RichText.c:566: error: ‘THIS’ was not declared in this scope
RichText.c:566: error: expected primary-expression before ‘)’ token
RichText.c:566: error: expected `;' before ‘wxPli_sv_2_object’
RichText.c:567: error: ‘wxString’ was not declared in this scope
RichText.c:567: error: expected `;' before ‘filename’
RichText.c:569: error: ‘filename’ was not declared in this scope
RichText.c:569: error: ‘wxConvUTF8’ was not declared in this scope
RichText.c:569: error: ‘wxConvLocal’ was not declared in this scope
RichText.c: In function ‘void XS_Wx__RichTextCtrl_SetDelayedLayoutThreshold(PerlInterpreter*, CV*)’:
RichText.c:595: error: ‘wxRichTextCtrl’ was not declared in this scope
RichText.c:595: error: ‘THIS’ was not declared in this scope
RichText.c:595: error: expected primary-expression before ‘)’ token
RichText.c:595: error: expected `;' before ‘wxPli_sv_2_object’
RichText.c: In function ‘void XS_Wx__RichTextCtrl_GetDelayedLayoutThreshold(PerlInterpreter*, CV*)’:
RichText.c:622: error: ‘wxRichTextCtrl’ was not declared in this scope
RichText.c:622: error: ‘THIS’ was not declared in this scope
RichText.c:622: error: expected primary-expression before ‘)’ token
RichText.c:622: error: expected `;' before ‘wxPli_sv_2_object’
RichText.c: In function ‘void XS_Wx__RichTextCtrl_SetStyleFromTo(PerlInterpreter*, CV*)’:
RichText.c:651: error: ‘wxRichTextCtrl’ was not declared in this scope
RichText.c:651: error: ‘THIS’ was not declared in this scope
RichText.c:651: error: expected primary-expression before ‘)’ token
RichText.c:651: error: expected `;' before ‘wxPli_sv_2_object’
RichText.c:655: error: ‘wxTextAttr’ was not declared in this scope
RichText.c:655: error: ‘style’ was not declared in this scope
RichText.c:655: error: expected primary-expression before ‘)’ token
RichText.c:655: error: expected `;' before ‘wxPli_sv_2_object’
RichText.c: In function ‘void XS_Wx__RichTextCtrl_SetStyleExFromTo(PerlInterpreter*, CV*)’:
RichText.c:683: error: ‘wxRichTextCtrl’ was not declared in this scope
RichText.c:683: error: ‘THIS’ was not declared in this scope
RichText.c:683: error: expected primary-expression before ‘)’ token
RichText.c:683: error: expected `;' before ‘wxPli_sv_2_object’
RichText.c:687: error: ‘wxTextAttrEx’ was not declared in this scope
RichText.c:687: error: ‘style’ was not declared in this scope
RichText.c:687: error: expected primary-expression before ‘)’ token
RichText.c:687: error: expected `;' before ‘wxPli_sv_2_object’
RichText.c: In function ‘void XS_Wx__RichTextCtrl_SetStyleRange(PerlInterpreter*, CV*)’:
RichText.c:715: error: ‘wxRichTextCtrl’ was not declared in this scope
RichText.c:715: error: ‘THIS’ was not declared in this scope
RichText.c:715: error: expected primary-expression before ‘)’ token
RichText.c:715: error: expected `;' before ‘wxPli_sv_2_object’
RichText.c:717: error: ‘wxRichTextRange’ was not declared in this scope
RichText.c:717: error: ‘range’ was not declared in this scope
RichText.c:717: error: expected primary-expression before ‘)’ token
RichText.c:717: error: expected `;' before ‘wxPli_sv_2_object’
RichText.c:718: error: ‘wxRichTextAttr’ was not declared in this scope
RichText.c:718: error: ‘style’ was not declared in this scope
RichText.c:718: error: expected primary-expression before ‘)’ token
RichText.c:718: error: expected `;' before ‘wxPli_sv_2_object’
RichText.c: In function ‘void XS_Wx__RichTextCtrl_GetBasicStyle(PerlInterpreter*, CV*)’:
RichText.c:871: error: ‘wxRichTextCtrl’ was not declared in this scope
RichText.c:871: error: ‘THIS’ was not declared in this scope
RichText.c:871: error: expected primary-expression before ‘)’ token
RichText.c:871: error: expected `;' before ‘wxPli_sv_2_object’
RichText.c:872: error: ‘wxTextAttrEx’ was not declared in this scope
RichText.c:872: error: ‘RETVAL’ was not declared in this scope
RichText.c:874: error: expected type-specifier before ‘wxTextAttrEx’
RichText.c:874: error: expected `;' before ‘wxTextAttrEx’
RichText.c: In function ‘void XS_Wx__RichTextCtrl_GetDefaultStyleEx(PerlInterpreter*, CV*)’:
RichText.c:902: error: ‘wxRichTextCtrl’ was not declared in this scope
RichText.c:902: error: ‘THIS’ was not declared in this scope
RichText.c:902: error: expected primary-expression before ‘)’ token
RichText.c:902: error: expected `;' before ‘wxPli_sv_2_object’
RichText.c:903: error: ‘wxTextAttrEx’ was not declared in this scope
RichText.c:903: error: ‘RETVAL’ was not declared in this scope
RichText.c:905: error: expected type-specifier before ‘wxTextAttrEx’
RichText.c:905: error: expected `;' before ‘wxTextAttrEx’
RichText.c: In function ‘void XS_Wx__RichTextCtrl_Newline(PerlInterpreter*, CV*)’:
RichText.c:933: error: ‘wxRichTextCtrl’ was not declared in this scope
RichText.c:933: error: ‘THIS’ was not declared in this scope
RichText.c:933: error: expected primary-expression before ‘)’ token
RichText.c:933: error: expected `;' before ‘wxPli_sv_2_object’
RichText.c: In function ‘void XS_Wx__RichTextCtrl_BeginStyle(PerlInterpreter*, CV*)’:
RichText.c:962: error: ‘wxRichTextCtrl’ was not declared in this scope
RichText.c:962: error: ‘THIS’ was not declared in this scope
RichText.c:962: error: expected primary-expression before ‘)’ token
RichText.c:962: error: expected `;' before ‘wxPli_sv_2_object’
RichText.c:964: error: ‘wxTextAttrEx’ was not declared in this scope
RichText.c:964: error: ‘style’ was not declared in this scope
RichText.c:964: error: expected primary-expression before ‘)’ token
RichText.c:964: error: expected `;' before ‘wxPli_sv_2_object’
RichText.c: In function ‘void XS_Wx__RichTextCtrl_EndStyle(PerlInterpreter*, CV*)’:
RichText.c:992: error: ‘wxRichTextCtrl’ was not declared in this scope
RichText.c:992: error: ‘THIS’ was not declared in this scope
RichText.c:992: error: expected primary-expression before ‘)’ token
RichText.c:992: error: expected `;' before ‘wxPli_sv_2_object’
RichText.c: In function ‘void XS_Wx__RichTextCtrl_EndAllStyles(PerlInterpreter*, CV*)’:
RichText.c:1021: error: ‘wxRichTextCtrl’ was not declared in this scope
RichText.c:1021: error: ‘THIS’ was not declared in this scope
RichText.c:1021: error: expected primary-expression before ‘)’ token
RichText.c:1021: error: expected `;' before ‘wxPli_sv_2_object’
RichText.c: In function ‘void XS_Wx__RichTextCtrl_BeginBold(PerlInterpreter*, CV*)’:
RichText.c:1050: error: ‘wxRichTextCtrl’ was not declared in this scope
RichText.c:1050: error: ‘THIS’ was not declared in this scope
RichText.c:1050: error: expected primary-expression before ‘)’ token
RichText.c:1050: error: expected `;' before ‘wxPli_sv_2_object’
RichText.c: In function ‘void XS_Wx__RichTextCtrl_EndBold(PerlInterpreter*, CV*)’:
RichText.c:1079: error: ‘wxRichTextCtrl’ was not declared in this scope
RichText.c:1079: error: ‘THIS’ was not declared in this scope
RichText.c:1079: error: expected primary-expression before ‘)’ token
RichText.c:1079: error: expected `;' before ‘wxPli_sv_2_object’
RichText.c: In function ‘void XS_Wx__RichTextCtrl_BeginItalic(PerlInterpreter*, CV*)’:
RichText.c:1108: error: ‘wxRichTextCtrl’ was not declared in this scope
RichText.c:1108: error: ‘THIS’ was not declared in this scope
RichText.c:1108: error: expected primary-expression before ‘)’ token
RichText.c:1108: error: expected `;' before ‘wxPli_sv_2_object’
RichText.c: In function ‘void XS_Wx__RichTextCtrl_EndItalic(PerlInterpreter*, CV*)’:
RichText.c:1137: error: ‘wxRichTextCtrl’ was not declared in this scope
RichText.c:1137: error: ‘THIS’ was not declared in this scope
RichText.c:1137: error: expected primary-expression before ‘)’ token
RichText.c:1137: error: expected `;' before ‘wxPli_sv_2_object’
RichText.c: In function ‘void XS_Wx__RichTextCtrl_BeginUnderline(PerlInterpreter*, CV*)’:
RichText.c:1166: error: ‘wxRichTextCtrl’ was not declared in this scope
RichText.c:1166: error: ‘THIS’ was not declared in this scope
RichText.c:1166: error: expected primary-expression before ‘)’ token
RichText.c:1166: error: expected `;' before ‘wxPli_sv_2_object’
RichText.c: In function ‘void XS_Wx__RichTextCtrl_EndUnderline(PerlInterpreter*, CV*)’:
RichText.c:1195: error: ‘wxRichTextCtrl’ was not declared in this scope
RichText.c:1195: error: ‘THIS’ was not declared in this scope
RichText.c:1195: error: expected primary-expression before ‘)’ token
RichText.c:1195: error: expected `;' before ‘wxPli_sv_2_object’
RichText.c: In function ‘void XS_Wx__RichTextCtrl_BeginFontSize(PerlInterpreter*, CV*)’:
RichText.c:1224: error: ‘wxRichTextCtrl’ was not declared in this scope
RichText.c:1224: error: ‘THIS’ was not declared in this scope
RichText.c:1224: error: expected primary-expression before ‘)’ token
RichText.c:1224: error: expected `;' before ‘wxPli_sv_2_object’
RichText.c: In function ‘void XS_Wx__RichTextCtrl_EndFontSize(PerlInterpreter*, CV*)’:
RichText.c:1254: error: ‘wxRichTextCtrl’ was not declared in this scope
RichText.c:1254: error: ‘THIS’ was not declared in this scope
RichText.c:1254: error: expected primary-expression before ‘)’ token
RichText.c:1254: error: expected `;' before ‘wxPli_sv_2_object’
RichText.c: In function ‘void XS_Wx__RichTextCtrl_BeginFont(PerlInterpreter*, CV*)’:
RichText.c:1283: error: ‘wxRichTextCtrl’ was not declared in this scope
RichText.c:1283: error: ‘THIS’ was not declared in this scope
RichText.c:1283: error: expected primary-expression before ‘)’ token
RichText.c:1283: error: expected `;' before ‘wxPli_sv_2_object’
RichText.c:1285: error: ‘wxFont’ was not declared in this scope
RichText.c:1285: error: ‘font’ was not declared in this scope
RichText.c:1285: error: expected primary-expression before ‘)’ token
RichText.c:1285: error: expected `;' before ‘wxPli_sv_2_object’
RichText.c: In function ‘void XS_Wx__RichTextCtrl_EndFont(PerlInterpreter*, CV*)’:
RichText.c:1313: error: ‘wxRichTextCtrl’ was not declared in this scope
RichText.c:1313: error: ‘THIS’ was not declared in this scope
RichText.c:1313: error: expected primary-expression before ‘)’ token
RichText.c:1313: error: expected `;' before ‘wxPli_sv_2_object’
RichText.c: In function ‘void XS_Wx__RichTextCtrl_BeginTextColour(PerlInterpreter*, CV*)’:
RichText.c:1342: error: ‘wxRichTextCtrl’ was not declared in this scope
RichText.c:1342: error: ‘THIS’ was not declared in this scope
RichText.c:1342: error: expected primary-expression before ‘)’ token
RichText.c:1342: error: expected `;' before ‘wxPli_sv_2_object’
RichText.c:1344: error: ‘wxColour’ was not declared in this scope
RichText.c:1344: error: ‘colour’ was not declared in this scope
RichText.c:1344: error: expected primary-expression before ‘)’ token
RichText.c:1344: error: expected `;' before ‘wxPli_sv_2_object’
RichText.c: In function ‘void XS_Wx__RichTextCtrl_EndTextColour(PerlInterpreter*, CV*)’:
RichText.c:1372: error: ‘wxRichTextCtrl’ was not declared in this scope
RichText.c:1372: error: ‘THIS’ was not declared in this scope
RichText.c:1372: error: expected primary-expression before ‘)’ token
RichText.c:1372: error: expected `;' before ‘wxPli_sv_2_object’
RichText.c: In function ‘void XS_Wx__RichTextCtrl_BeginAlignment(PerlInterpreter*, CV*)’:
RichText.c:1401: error: ‘wxRichTextCtrl’ was not declared in this scope
RichText.c:1401: error: ‘THIS’ was not declared in this scope
RichText.c:1401: error: expected primary-expression before ‘)’ token
RichText.c:1401: error: expected `;' before ‘wxPli_sv_2_object’
RichText.c:1403: error: ‘wxTextAttrAlignment’ was not declared in this scope
RichText.c:1403: error: expected `;' before ‘alignment’
RichText.c:1405: error: ‘alignment’ was not declared in this scope
RichText.c: In function ‘void XS_Wx__RichTextCtrl_EndAlignment(PerlInterpreter*, CV*)’:
RichText.c:1431: error: ‘wxRichTextCtrl’ was not declared in this scope
RichText.c:1431: error: ‘THIS’ was not declared in this scope
RichText.c:1431: error: expected primary-expression before ‘)’ token
RichText.c:1431: error: expected `;' before ‘wxPli_sv_2_object’
RichText.c: In function ‘void XS_Wx__RichTextCtrl_BeginLeftIndent(PerlInterpreter*, CV*)’:
RichText.c:1460: error: ‘wxRichTextCtrl’ was not declared in this scope
RichText.c:1460: error: ‘THIS’ was not declared in this scope
RichText.c:1460: error: expected primary-expression before ‘)’ token
RichText.c:1460: error: expected `;' before ‘wxPli_sv_2_object’
RichText.c: In function ‘void XS_Wx__RichTextCtrl_EndLeftIndent(PerlInterpreter*, CV*)’:
RichText.c:1497: error: ‘wxRichTextCtrl’ was not declared in this scope
RichText.c:1497: error: ‘THIS’ was not declared in this scope
RichText.c:1497: error: expected primary-expression before ‘)’ token
RichText.c:1497: error: expected `;' before ‘wxPli_sv_2_object’
RichText.c: In function ‘void XS_Wx__RichTextCtrl_BeginRightIndent(PerlInterpreter*, CV*)’:
RichText.c:1526: error: ‘wxRichTextCtrl’ was not declared in this scope
RichText.c:1526: error: ‘THIS’ was not declared in this scope
RichText.c:1526: error: expected primary-expression before ‘)’ token
RichText.c:1526: error: expected `;' before ‘wxPli_sv_2_object’
RichText.c: In function ‘void XS_Wx__RichTextCtrl_EndRightIndent(PerlInterpreter*, CV*)’:
RichText.c:1556: error: ‘wxRichTextCtrl’ was not declared in this scope
RichText.c:1556: error: ‘THIS’ was not declared in this scope
RichText.c:1556: error: expected primary-expression before ‘)’ token
RichText.c:1556: error: expected `;' before ‘wxPli_sv_2_object’
RichText.c: In function ‘void XS_Wx__RichTextCtrl_BeginParagraphSpacing(PerlInterpreter*, CV*)’:
RichText.c:1585: error: ‘wxRichTextCtrl’ was not declared in this scope
RichText.c:1585: error: ‘THIS’ was not declared in this scope
RichText.c:1585: error: expected primary-expression before ‘)’ token
RichText.c:1585: error: expected `;' before ‘wxPli_sv_2_object’
RichText.c: In function ‘void XS_Wx__RichTextCtrl_EndParagraphSpacing(PerlInterpreter*, CV*)’:
RichText.c:1616: error: ‘wxRichTextCtrl’ was not declared in this scope
RichText.c:1616: error: ‘THIS’ was not declared in this scope
RichText.c:1616: error: expected primary-expression before ‘)’ token
RichText.c:1616: error: expected `;' before ‘wxPli_sv_2_object’
RichText.c: In function ‘void XS_Wx__RichTextCtrl_BeginLineSpacing(PerlInterpreter*, CV*)’:
RichText.c:1645: error: ‘wxRichTextCtrl’ was not declared in this scope
RichText.c:1645: error: ‘THIS’ was not declared in this scope
RichText.c:1645: error: expected primary-expression before ‘)’ token
RichText.c:1645: error: expected `;' before ‘wxPli_sv_2_object’
RichText.c: In function ‘void XS_Wx__RichTextCtrl_EndLineSpacing(PerlInterpreter*, CV*)’:
RichText.c:1675: error: ‘wxRichTextCtrl’ was not declared in this scope
RichText.c:1675: error: ‘THIS’ was not declared in this scope
RichText.c:1675: error: expected primary-expression before ‘)’ token
RichText.c:1675: error: expected `;' before ‘wxPli_sv_2_object’
RichText.c: In function ‘void XS_Wx__RichTextCtrl_BeginNumberedBullet(PerlInterpreter*, CV*)’:
RichText.c:1704: error: ‘wxRichTextCtrl’ was not declared in this scope
RichText.c:1704: error: ‘THIS’ was not declared in this scope
RichText.c:1704: error: expected primary-expression before ‘)’ token
RichText.c:1704: error: expected `;' before ‘wxPli_sv_2_object’
RichText.c:1712: error: ‘wxTEXT_ATTR_BULLET_STYLE_ARABIC’ was not declared in this scope
RichText.c:1712: error: ‘wxTEXT_ATTR_BULLET_STYLE_PERIOD’ was not declared in this scope
RichText.c: In function ‘void XS_Wx__RichTextCtrl_EndNumberedBullet(PerlInterpreter*, CV*)’:
RichText.c:1743: error: ‘wxRichTextCtrl’ was not declared in this scope
RichText.c:1743: error: ‘THIS’ was not declared in this scope
RichText.c:1743: error: expected primary-expression before ‘)’ token
RichText.c:1743: error: expected `;' before ‘wxPli_sv_2_object’
RichText.c: In function ‘void XS_Wx__RichTextCtrl_BeginSymbolBullet(PerlInterpreter*, CV*)’:
RichText.c:1821: error: ‘wxRichTextCtrl’ was not declared in this scope
RichText.c:1821: error: ‘THIS’ was not declared in this scope
RichText.c:1821: error: expected primary-expression before ‘)’ token
RichText.c:1821: error: expected `;' before ‘wxPli_sv_2_object’
RichText.c:1823: error: ‘wxChar’ was not declared in this scope
RichText.c:1823: error: expected `;' before ‘symbol’
RichText.c:1829: error: ‘wxTEXT_ATTR_BULLET_STYLE_SYMBOL’ was not declared in this scope
RichText.c:1834: error: ‘symbol’ was not declared in this scope
RichText.c: In function ‘void XS_Wx__RichTextCtrl_EndSymbolBullet(PerlInterpreter*, CV*)’:
RichText.c:1861: error: ‘wxRichTextCtrl’ was not declared in this scope
RichText.c:1861: error: ‘THIS’ was not declared in this scope
RichText.c:1861: error: expected primary-expression before ‘)’ token
RichText.c:1861: error: expected `;' before ‘wxPli_sv_2_object’
RichText.c: In function ‘void XS_Wx__RichTextCtrl_BeginCharacterStyle(PerlInterpreter*, CV*)’:
RichText.c:1965: error: ‘wxRichTextCtrl’ was not declared in this scope
RichText.c:1965: error: ‘THIS’ was not declared in this scope
RichText.c:1965: error: expected primary-expression before ‘)’ token
RichText.c:1965: error: expected `;' before ‘wxPli_sv_2_object’
RichText.c:1967: error: ‘wxString’ was not declared in this scope
RichText.c:1967: error: expected `;' before ‘characterStyle’
RichText.c:1969: error: ‘characterStyle’ was not declared in this scope
RichText.c:1969: error: ‘wxConvUTF8’ was not declared in this scope
RichText.c:1969: error: ‘wxConvLocal’ was not declared in this scope
RichText.c: In function ‘void XS_Wx__RichTextCtrl_EndCharacterStyle(PerlInterpreter*, CV*)’:
RichText.c:1997: error: ‘wxRichTextCtrl’ was not declared in this scope
RichText.c:1997: error: ‘THIS’ was not declared in this scope
RichText.c:1997: error: expected primary-expression before ‘)’ token
RichText.c:1997: error: expected `;' before ‘wxPli_sv_2_object’
RichText.c: In function ‘void XS_Wx__RichTextCtrl_BeginParagraphStyle(PerlInterpreter*, CV*)’:
RichText.c:2026: error: ‘wxRichTextCtrl’ was not declared in this scope
RichText.c:2026: error: ‘THIS’ was not declared in this scope
RichText.c:2026: error: expected primary-expression before ‘)’ token
RichText.c:2026: error: expected `;' before ‘wxPli_sv_2_object’
RichText.c:2028: error: ‘wxString’ was not declared in this scope
RichText.c:2028: error: expected `;' before ‘paragraphStyle’
RichText.c:2030: error: ‘paragraphStyle’ was not declared in this scope
RichText.c:2030: error: ‘wxConvUTF8’ was not declared in this scope
RichText.c:2030: error: ‘wxConvLocal’ was not declared in this scope
RichText.c: In function ‘void XS_Wx__RichTextCtrl_EndParagraphStyle(PerlInterpreter*, CV*)’:
RichText.c:2058: error: ‘wxRichTextCtrl’ was not declared in this scope
RichText.c:2058: error: ‘THIS’ was not declared in this scope
RichText.c:2058: error: expected primary-expression before ‘)’ token
RichText.c:2058: error: expected `;' before ‘wxPli_sv_2_object’
RichText.c: In function ‘void XS_Wx__RichTextCtrl_SetDefaultStyleToCursorStyle(PerlInterpreter*, CV*)’:
RichText.c:2235: error: ‘wxRichTextCtrl’ was not declared in this scope
RichText.c:2235: error: ‘THIS’ was not declared in this scope
RichText.c:2235: error: expected primary-expression before ‘)’ token
RichText.c:2235: error: expected `;' before ‘wxPli_sv_2_object’
RichText.c: In function ‘void XS_Wx__RichTextCtrl_SelectNone(PerlInterpreter*, CV*)’:
RichText.c:2306: error: ‘wxRichTextCtrl’ was not declared in this scope
RichText.c:2306: error: ‘THIS’ was not declared in this scope
RichText.c:2306: error: expected primary-expression before ‘)’ token
RichText.c:2306: error: expected `;' before ‘wxPli_sv_2_object’
RichText.c: In function ‘void XS_Wx__RichTextCtrl_GetSelectionRange(PerlInterpreter*, CV*)’:
RichText.c:2367: error: ‘wxRichTextCtrl’ was not declared in this scope
RichText.c:2367: error: ‘THIS’ was not declared in this scope
RichText.c:2367: error: expected primary-expression before ‘)’ token
RichText.c:2367: error: expected `;' before ‘wxPli_sv_2_object’
RichText.c:2368: error: ‘wxRichTextRange’ was not declared in this scope
RichText.c:2368: error: ‘RETVAL’ was not declared in this scope
RichText.c:2370: error: expected type-specifier before ‘wxRichTextRange’
RichText.c:2370: error: expected `;' before ‘wxRichTextRange’
RichText.c: In function ‘void XS_Wx__RichTextCtrl_SetSelectionRange(PerlInterpreter*, CV*)’:
RichText.c:2398: error: ‘wxRichTextCtrl’ was not declared in this scope
RichText.c:2398: error: ‘THIS’ was not declared in this scope
RichText.c:2398: error: expected primary-expression before ‘)’ token
RichText.c:2398: error: expected `;' before ‘wxPli_sv_2_object’
RichText.c:2399: error: ‘wxRichTextRange’ was not declared in this scope
RichText.c:2399: error: ‘range’ was not declared in this scope
RichText.c:2399: error: expected primary-expression before ‘)’ token
RichText.c:2399: error: expected `;' before ‘wxPli_sv_2_object’
RichText.c: In function ‘void XS_Wx__RichTextCtrl_HasSelection(PerlInterpreter*, CV*)’:
RichText.c:2488: error: ‘wxRichTextCtrl’ was not declared in this scope
RichText.c:2488: error: ‘THIS’ was not declared in this scope
RichText.c:2488: error: expected primary-expression before ‘)’ token
RichText.c:2488: error: expected `;' before ‘wxPli_sv_2_object’
RichText.c: In function ‘void XS_Wx__RichTextCtrl_AddParagraph(PerlInterpreter*, CV*)’:
RichText.c:2517: error: ‘wxRichTextCtrl’ was not declared in this scope
RichText.c:2517: error: ‘THIS’ was not declared in this scope
RichText.c:2517: error: expected primary-expression before ‘)’ token
RichText.c:2517: error: expected `;' before ‘wxPli_sv_2_object’
RichText.c:2518: error: ‘wxRichTextRange’ was not declared in this scope
RichText.c:2518: error: ‘RETVAL’ was not declared in this scope
RichText.c:2519: error: ‘wxString’ was not declared in this scope
RichText.c:2519: error: expected `;' before ‘text’
RichText.c:2521: error: ‘text’ was not declared in this scope
RichText.c:2521: error: ‘wxConvUTF8’ was not declared in this scope
RichText.c:2521: error: ‘wxConvLocal’ was not declared in this scope
RichText.c:2523: error: expected type-specifier before ‘wxRichTextRange’
RichText.c:2523: error: expected `;' before ‘wxRichTextRange’
RichText.c: In function ‘void XS_Wx__RichTextCtrl_AddImage(PerlInterpreter*, CV*)’:
RichText.c:2551: error: ‘wxRichTextCtrl’ was not declared in this scope
RichText.c:2551: error: ‘THIS’ was not declared in this scope
RichText.c:2551: error: expected primary-expression before ‘)’ token
RichText.c:2551: error: expected `;' before ‘wxPli_sv_2_object’
RichText.c:2552: error: ‘wxRichTextRange’ was not declared in this scope
RichText.c:2552: error: ‘RETVAL’ was not declared in this scope
RichText.c:2553: error: ‘wxImage’ was not declared in this scope
RichText.c:2553: error: ‘image’ was not declared in this scope
RichText.c:2553: error: expected primary-expression before ‘)’ token
RichText.c:2553: error: expected `;' before ‘wxPli_sv_2_object’
RichText.c:2555: error: expected type-specifier before ‘wxRichTextRange’
RichText.c:2555: error: expected `;' before ‘wxRichTextRange’
RichText.c: In function ‘void XS_Wx__RichTextCtrl_LayoutContent(PerlInterpreter*, CV*)’:
RichText.c:2583: error: ‘wxRichTextCtrl’ was not declared in this scope
RichText.c:2583: error: ‘THIS’ was not declared in this scope
RichText.c:2583: error: expected primary-expression before ‘)’ token
RichText.c:2583: error: expected `;' before ‘wxPli_sv_2_object’
RichText.c: In function ‘void XS_Wx__RichTextCtrl_MoveCaret(PerlInterpreter*, CV*)’:
RichText.c:2619: error: ‘wxRichTextCtrl’ was not declared in this scope
RichText.c:2619: error: ‘THIS’ was not declared in this scope
RichText.c:2619: error: expected primary-expression before ‘)’ token
RichText.c:2619: error: expected `;' before ‘wxPli_sv_2_object’
RichText.c: In function ‘void XS_Wx__RichTextCtrl_MoveRight(PerlInterpreter*, CV*)’:
RichText.c:2656: error: ‘wxRichTextCtrl’ was not declared in this scope
RichText.c:2656: error: ‘THIS’ was not declared in this scope
RichText.c:2656: error: expected primary-expression before ‘)’ token
RichText.c:2656: error: expected `;' before ‘wxPli_sv_2_object’
RichText.c: In function ‘void XS_Wx__RichTextCtrl_MoveLeft(PerlInterpreter*, CV*)’:
RichText.c:2699: error: ‘wxRichTextCtrl’ was not declared in this scope
RichText.c:2699: error: ‘THIS’ was not declared in this scope
RichText.c:2699: error: expected primary-expression before ‘)’ token
RichText.c:2699: error: expected `;' before ‘wxPli_sv_2_object’
RichText.c: In function ‘void XS_Wx__RichTextCtrl_MoveUp(PerlInterpreter*, CV*)’:
RichText.c:2742: error: ‘wxRichTextCtrl’ was not declared in this scope
RichText.c:2742: error: ‘THIS’ was not declared in this scope
RichText.c:2742: error: expected primary-expression before ‘)’ token
RichText.c:2742: error: expected `;' before ‘wxPli_sv_2_object’
RichText.c: In function ‘void XS_Wx__RichTextCtrl_MoveDown(PerlInterpreter*, CV*)’:
RichText.c:2785: error: ‘wxRichTextCtrl’ was not declared in this scope
RichText.c:2785: error: ‘THIS’ was not declared in this scope
RichText.c:2785: error: expected primary-expression before ‘)’ token
RichText.c:2785: error: expected `;' before ‘wxPli_sv_2_object’
RichText.c: In function ‘void XS_Wx__RichTextCtrl_MoveToLineEnd(PerlInterpreter*, CV*)’:
RichText.c:2828: error: ‘wxRichTextCtrl’ was not declared in this scope
RichText.c:2828: error: ‘THIS’ was not declared in this scope
RichText.c:2828: error: expected primary-expression before ‘)’ token
RichText.c:2828: error: expected `;' before ‘wxPli_sv_2_object’
RichText.c: In function ‘void XS_Wx__RichTextCtrl_MoveToLineStart(PerlInterpreter*, CV*)’:
RichText.c:2864: error: ‘wxRichTextCtrl’ was not declared in this scope
RichText.c:2864: error: ‘THIS’ was not declared in this scope
RichText.c:2864: error: expected primary-expression before ‘)’ token
RichText.c:2864: error: expected `;' before ‘wxPli_sv_2_object’
RichText.c: In function ‘void XS_Wx__RichTextCtrl_MoveToParagraphEnd(PerlInterpreter*, CV*)’:
RichText.c:2900: error: ‘wxRichTextCtrl’ was not declared in this scope
RichText.c:2900: error: ‘THIS’ was not declared in this scope
RichText.c:2900: error: expected primary-expression before ‘)’ token
RichText.c:2900: error: expected `;' before ‘wxPli_sv_2_object’
RichText.c: In function ‘void XS_Wx__RichTextCtrl_MoveToParagraphStart(PerlInterpreter*, CV*)’:
RichText.c:2936: error: ‘wxRichTextCtrl’ was not declared in this scope
RichText.c:2936: error: ‘THIS’ was not declared in this scope
RichText.c:2936: error: expected primary-expression before ‘)’ token
RichText.c:2936: error: expected `;' before ‘wxPli_sv_2_object’
RichText.c: In function ‘void XS_Wx__RichTextCtrl_MoveHome(PerlInterpreter*, CV*)’:
RichText.c:2972: error: ‘wxRichTextCtrl’ was not declared in this scope
RichText.c:2972: error: ‘THIS’ was not declared in this scope
RichText.c:2972: error: expected primary-expression before ‘)’ token
RichText.c:2972: error: expected `;' before ‘wxPli_sv_2_object’
RichText.c: In function ‘void XS_Wx__RichTextCtrl_MoveEnd(PerlInterpreter*, CV*)’:
RichText.c:3008: error: ‘wxRichTextCtrl’ was not declared in this scope
RichText.c:3008: error: ‘THIS’ was not declared in this scope
RichText.c:3008: error: expected primary-expression before ‘)’ token
RichText.c:3008: error: expected `;' before ‘wxPli_sv_2_object’
RichText.c: In function ‘void XS_Wx__RichTextCtrl_PageUp(PerlInterpreter*, CV*)’:
RichText.c:3044: error: ‘wxRichTextCtrl’ was not declared in this scope
RichText.c:3044: error: ‘THIS’ was not declared in this scope
RichText.c:3044: error: expected primary-expression before ‘)’ token
RichText.c:3044: error: expected `;' before ‘wxPli_sv_2_object’
RichText.c: In function ‘void XS_Wx__RichTextCtrl_PageDown(PerlInterpreter*, CV*)’:
RichText.c:3087: error: ‘wxRichTextCtrl’ was not declared in this scope
RichText.c:3087: error: ‘THIS’ was not declared in this scope
RichText.c:3087: error: expected primary-expression before ‘)’ token
RichText.c:3087: error: expected `;' before ‘wxPli_sv_2_object’
RichText.c: In function ‘void XS_Wx__RichTextCtrl_WordLeft(PerlInterpreter*, CV*)’:
RichText.c:3130: error: ‘wxRichTextCtrl’ was not declared in this scope
RichText.c:3130: error: ‘THIS’ was not declared in this scope
RichText.c:3130: error: expected primary-expression before ‘)’ token
RichText.c:3130: error: expected `;' before ‘wxPli_sv_2_object’
RichText.c: In function ‘void XS_Wx__RichTextCtrl_WordRight(PerlInterpreter*, CV*)’:
RichText.c:3173: error: ‘wxRichTextCtrl’ was not declared in this scope
RichText.c:3173: error: ‘THIS’ was not declared in this scope
RichText.c:3173: error: expected primary-expression before ‘)’ token
RichText.c:3173: error: expected `;' before ‘wxPli_sv_2_object’
RichText.c: In function ‘void XS_Wx__RichTextCtrl_BeginBatchUndo(PerlInterpreter*, CV*)’:
RichText.c:3216: error: ‘wxRichTextCtrl’ was not declared in this scope
RichText.c:3216: error: ‘THIS’ was not declared in this scope
RichText.c:3216: error: expected primary-expression before ‘)’ token
RichText.c:3216: error: expected `;' before ‘wxPli_sv_2_object’
RichText.c:3218: error: ‘wxString’ was not declared in this scope
RichText.c:3218: error: expected `;' before ‘cmdName’
RichText.c:3220: error: ‘cmdName’ was not declared in this scope
RichText.c:3220: error: ‘wxConvUTF8’ was not declared in this scope
RichText.c:3220: error: ‘wxConvLocal’ was not declared in this scope
RichText.c: In function ‘void XS_Wx__RichTextCtrl_EndBatchUndo(PerlInterpreter*, CV*)’:
RichText.c:3248: error: ‘wxRichTextCtrl’ was not declared in this scope
RichText.c:3248: error: ‘THIS’ was not declared in this scope
RichText.c:3248: error: expected primary-expression before ‘)’ token
RichText.c:3248: error: expected `;' before ‘wxPli_sv_2_object’
RichText.c: In function ‘void XS_Wx__RichTextCtrl_BatchingUndo(PerlInterpreter*, CV*)’:
RichText.c:3277: error: ‘wxRichTextCtrl’ was not declared in this scope
RichText.c:3277: error: ‘THIS’ was not declared in this scope
RichText.c:3277: error: expected primary-expression before ‘)’ token
RichText.c:3277: error: expected `;' before ‘wxPli_sv_2_object’
RichText.c: In function ‘void XS_Wx__RichTextCtrl_BeginSuppressUndo(PerlInterpreter*, CV*)’:
RichText.c:3306: error: ‘wxRichTextCtrl’ was not declared in this scope
RichText.c:3306: error: ‘THIS’ was not declared in this scope
RichText.c:3306: error: expected primary-expression before ‘)’ token
RichText.c:3306: error: expected `;' before ‘wxPli_sv_2_object’
RichText.c: In function ‘void XS_Wx__RichTextCtrl_EndSuppressUndo(PerlInterpreter*, CV*)’:
RichText.c:3335: error: ‘wxRichTextCtrl’ was not declared in this scope
RichText.c:3335: error: ‘THIS’ was not declared in this scope
RichText.c:3335: error: expected primary-expression before ‘)’ token
RichText.c:3335: error: expected `;' before ‘wxPli_sv_2_object’
RichText.c: In function ‘void XS_Wx__RichTextCtrl_SuppressingUndo(PerlInterpreter*, CV*)’:
RichText.c:3364: error: ‘wxRichTextCtrl’ was not declared in this scope
RichText.c:3364: error: ‘THIS’ was not declared in this scope
RichText.c:3364: error: expected primary-expression before ‘)’ token
RichText.c:3364: error: expected `;' before ‘wxPli_sv_2_object’
RichText.c: In function ‘void XS_Wx__RichTextCtrl_CanDeleteSelection(PerlInterpreter*, CV*)’:
RichText.c:3393: error: ‘wxRichTextCtrl’ was not declared in this scope
RichText.c:3393: error: ‘THIS’ was not declared in this scope
RichText.c:3393: error: expected primary-expression before ‘)’ token
RichText.c:3393: error: expected `;' before ‘wxPli_sv_2_object’
RichText.c: In function ‘void XS_Wx__RichTextCtrl_DeleteSelection(PerlInterpreter*, CV*)’:
RichText.c:3422: error: ‘wxRichTextCtrl’ was not declared in this scope
RichText.c:3422: error: ‘THIS’ was not declared in this scope
RichText.c:3422: error: expected primary-expression before ‘)’ token
RichText.c:3422: error: expected `;' before ‘wxPli_sv_2_object’
RichText.c: In function ‘void XS_Wx__RichTextCtrl_HasCARich(PerlInterpreter*, CV*)’:
RichText.c:3448: error: ‘wxRichTextCtrl’ was not declared in this scope
RichText.c:3448: error: ‘THIS’ was not declared in this scope
RichText.c:3448: error: expected primary-expression before ‘)’ token
RichText.c:3448: error: expected `;' before ‘wxPli_sv_2_object’
RichText.c:3450: error: ‘wxRichTextRange’ was not declared in this scope
RichText.c:3450: error: ‘range’ was not declared in this scope
RichText.c:3450: error: expected primary-expression before ‘)’ token
RichText.c:3450: error: expected `;' before ‘wxPli_sv_2_object’
RichText.c:3451: error: ‘wxTextAttrEx’ was not declared in this scope
RichText.c:3451: error: ‘style’ was not declared in this scope
RichText.c:3451: error: expected primary-expression before ‘)’ token
RichText.c:3451: error: expected `;' before ‘wxPli_sv_2_object’
RichText.c: In function ‘void XS_Wx__RichTextCtrl_HasCAEx(PerlInterpreter*, CV*)’:
RichText.c:3479: error: ‘wxRichTextCtrl’ was not declared in this scope
RichText.c:3479: error: ‘THIS’ was not declared in this scope
RichText.c:3479: error: expected primary-expression before ‘)’ token
RichText.c:3479: error: expected `;' before ‘wxPli_sv_2_object’
RichText.c:3481: error: ‘wxRichTextRange’ was not declared in this scope
RichText.c:3481: error: ‘range’ was not declared in this scope
RichText.c:3481: error: expected primary-expression before ‘)’ token
RichText.c:3481: error: expected `;' before ‘wxPli_sv_2_object’
RichText.c:3482: error: ‘wxRichTextAttr’ was not declared in this scope
RichText.c:3482: error: ‘style’ was not declared in this scope
RichText.c:3482: error: expected primary-expression before ‘)’ token
RichText.c:3482: error: expected `;' before ‘wxPli_sv_2_object’
RichText.c: In function ‘void XS_Wx__RichTextCtrl_HasPARich(PerlInterpreter*, CV*)’:
RichText.c:3510: error: ‘wxRichTextCtrl’ was not declared in this scope
RichText.c:3510: error: ‘THIS’ was not declared in this scope
RichText.c:3510: error: expected primary-expression before ‘)’ token
RichText.c:3510: error: expected `;' before ‘wxPli_sv_2_object’
RichText.c:3512: error: ‘wxRichTextRange’ was not declared in this scope
RichText.c:3512: error: ‘range’ was not declared in this scope
RichText.c:3512: error: expected primary-expression before ‘)’ token
RichText.c:3512: error: expected `;' before ‘wxPli_sv_2_object’
RichText.c:3513: error: ‘wxTextAttrEx’ was not declared in this scope
RichText.c:3513: error: ‘style’ was not declared in this scope
RichText.c:3513: error: expected primary-expression before ‘)’ token
RichText.c:3513: error: expected `;' before ‘wxPli_sv_2_object’
RichText.c: In function ‘void XS_Wx__RichTextCtrl_HasPAEx(PerlInterpreter*, CV*)’:
RichText.c:3541: error: ‘wxRichTextCtrl’ was not declared in this scope
RichText.c:3541: error: ‘THIS’ was not declared in this scope
RichText.c:3541: error: expected primary-expression before ‘)’ token
RichText.c:3541: error: expected `;' before ‘wxPli_sv_2_object’
RichText.c:3543: error: ‘wxRichTextRange’ was not declared in this scope
RichText.c:3543: error: ‘range’ was not declared in this scope
RichText.c:3543: error: expected primary-expression before ‘)’ token
RichText.c:3543: error: expected `;' before ‘wxPli_sv_2_object’
RichText.c:3544: error: ‘wxRichTextAttr’ was not declared in this scope
RichText.c:3544: error: ‘style’ was not declared in this scope
RichText.c:3544: error: expected primary-expression before ‘)’ token
RichText.c:3544: error: expected `;' before ‘wxPli_sv_2_object’
RichText.c: In function ‘void XS_Wx__RichTextCtrl_IsSelectionBold(PerlInterpreter*, CV*)’:
RichText.c:3572: error: ‘wxRichTextCtrl’ was not declared in this scope
RichText.c:3572: error: ‘THIS’ was not declared in this scope
RichText.c:3572: error: expected primary-expression before ‘)’ token
RichText.c:3572: error: expected `;' before ‘wxPli_sv_2_object’
RichText.c: In function ‘void XS_Wx__RichTextCtrl_IsSelectionItalics(PerlInterpreter*, CV*)’:
RichText.c:3601: error: ‘wxRichTextCtrl’ was not declared in this scope
RichText.c:3601: error: ‘THIS’ was not declared in this scope
RichText.c:3601: error: expected primary-expression before ‘)’ token
RichText.c:3601: error: expected `;' before ‘wxPli_sv_2_object’
RichText.c: In function ‘void XS_Wx__RichTextCtrl_IsSelectionUnderlined(PerlInterpreter*, CV*)’:
RichText.c:3630: error: ‘wxRichTextCtrl’ was not declared in this scope
RichText.c:3630: error: ‘THIS’ was not declared in this scope
RichText.c:3630: error: expected primary-expression before ‘)’ token
RichText.c:3630: error: expected `;' before ‘wxPli_sv_2_object’
RichText.c: In function ‘void XS_Wx__RichTextCtrl_IsSelectionAligned(PerlInterpreter*, CV*)’:
RichText.c:3659: error: ‘wxRichTextCtrl’ was not declared in this scope
RichText.c:3659: error: ‘THIS’ was not declared in this scope
RichText.c:3659: error: expected primary-expression before ‘)’ token
RichText.c:3659: error: expected `;' before ‘wxPli_sv_2_object’
RichText.c:3661: error: ‘wxTextAttrAlignment’ was not declared in this scope
RichText.c:3661: error: expected `;' before ‘alignment’
RichText.c:3663: error: ‘alignment’ was not declared in this scope
RichText.c: In function ‘void XS_Wx__RichTextCtrl_ApplyBoldToSelection(PerlInterpreter*, CV*)’:
RichText.c:3689: error: ‘wxRichTextCtrl’ was not declared in this scope
RichText.c:3689: error: ‘THIS’ was not declared in this scope
RichText.c:3689: error: expected primary-expression before ‘)’ token
RichText.c:3689: error: expected `;' before ‘wxPli_sv_2_object’
RichText.c: In function ‘void XS_Wx__RichTextCtrl_ApplyItalicToSelection(PerlInterpreter*, CV*)’:
RichText.c:3718: error: ‘wxRichTextCtrl’ was not declared in this scope
RichText.c:3718: error: ‘THIS’ was not declared in this scope
RichText.c:3718: error: expected primary-expression before ‘)’ token
RichText.c:3718: error: expected `;' before ‘wxPli_sv_2_object’
RichText.c: In function ‘void XS_Wx__RichTextCtrl_ApplyUnderlineToSelection(PerlInterpreter*, CV*)’:
RichText.c:3747: error: ‘wxRichTextCtrl’ was not declared in this scope
RichText.c:3747: error: ‘THIS’ was not declared in this scope
RichText.c:3747: error: expected primary-expression before ‘)’ token
RichText.c:3747: error: expected `;' before ‘wxPli_sv_2_object’
RichText.c: In function ‘void XS_Wx__RichTextCtrl_ApplyAlignmentToSelection(PerlInterpreter*, CV*)’:
RichText.c:3776: error: ‘wxRichTextCtrl’ was not declared in this scope
RichText.c:3776: error: ‘THIS’ was not declared in this scope
RichText.c:3776: error: expected primary-expression before ‘)’ token
RichText.c:3776: error: expected `;' before ‘wxPli_sv_2_object’
RichText.c:3778: error: ‘wxTextAttrAlignment’ was not declared in this scope
RichText.c:3778: error: expected `;' before ‘alignment’
RichText.c:3780: error: ‘alignment’ was not declared in this scope
RichText.c: In function ‘void XS_Wx__RichTextCtrl_PositionCaret(PerlInterpreter*, CV*)’:
RichText.c:4003: error: ‘wxRichTextCtrl’ was not declared in this scope
RichText.c:4003: error: ‘THIS’ was not declared in this scope
RichText.c:4003: error: expected primary-expression before ‘)’ token
RichText.c:4003: error: expected `;' before ‘wxPli_sv_2_object’
RichText.c: In function ‘void XS_Wx__RichTextCtrl_ExtendSelection(PerlInterpreter*, CV*)’:
RichText.c:4029: error: ‘wxRichTextCtrl’ was not declared in this scope
RichText.c:4029: error: ‘THIS’ was not declared in this scope
RichText.c:4029: error: expected primary-expression before ‘)’ token
RichText.c:4029: error: expected `;' before ‘wxPli_sv_2_object’
RichText.c: In function ‘void XS_Wx__RichTextCtrl_ScrollIntoView(PerlInterpreter*, CV*)’:
RichText.c:4061: error: ‘wxRichTextCtrl’ was not declared in this scope
RichText.c:4061: error: ‘THIS’ was not declared in this scope
RichText.c:4061: error: expected primary-expression before ‘)’ token
RichText.c:4061: error: expected `;' before ‘wxPli_sv_2_object’
RichText.c: In function ‘void XS_Wx__RichTextCtrl_SetCaretPosition(PerlInterpreter*, CV*)’:
RichText.c:4092: error: ‘wxRichTextCtrl’ was not declared in this scope
RichText.c:4092: error: ‘THIS’ was not declared in this scope
RichText.c:4092: error: expected primary-expression before ‘)’ token
RichText.c:4092: error: expected `;' before ‘wxPli_sv_2_object’
RichText.c: In function ‘void XS_Wx__RichTextCtrl_GetCaretPosition(PerlInterpreter*, CV*)’:
RichText.c:4126: error: ‘wxRichTextCtrl’ was not declared in this scope
RichText.c:4126: error: ‘THIS’ was not declared in this scope
RichText.c:4126: error: expected primary-expression before ‘)’ token
RichText.c:4126: error: expected `;' before ‘wxPli_sv_2_object’
RichText.c: In function ‘void XS_Wx__RichTextCtrl_MoveCaretForward(PerlInterpreter*, CV*)’:
RichText.c:4190: error: ‘wxRichTextCtrl’ was not declared in this scope
RichText.c:4190: error: ‘THIS’ was not declared in this scope
RichText.c:4190: error: expected primary-expression before ‘)’ token
RichText.c:4190: error: expected `;' before ‘wxPli_sv_2_object’
RichText.c: In function ‘void XS_Wx__RichTextCtrl_MoveCaretBack(PerlInterpreter*, CV*)’:
RichText.c:4217: error: ‘wxRichTextCtrl’ was not declared in this scope
RichText.c:4217: error: ‘THIS’ was not declared in this scope
RichText.c:4217: error: expected primary-expression before ‘)’ token
RichText.c:4217: error: expected `;' before ‘wxPli_sv_2_object’
RichText.c: In function ‘void XS_Wx__RichTextCtrl_GetPhysicalPoint(PerlInterpreter*, CV*)’:
RichText.c:4244: error: ‘wxRichTextCtrl’ was not declared in this scope
RichText.c:4244: error: ‘THIS’ was not declared in this scope
RichText.c:4244: error: expected primary-expression before ‘)’ token
RichText.c:4244: error: expected `;' before ‘wxPli_sv_2_object’
RichText.c:4245: error: ‘wxPoint’ was not declared in this scope
RichText.c:4245: error: expected `;' before ‘RETVAL’
RichText.c:4246: error: expected `;' before ‘ptLogical’
RichText.c:4248: error: ‘RETVAL’ was not declared in this scope
RichText.c:4248: error: ‘ptLogical’ was not declared in this scope
RichText.c:4257: error: expected type-specifier before ‘wxPoint’
RichText.c:4257: error: expected `)' before ‘wxPoint’
RichText.c: In function ‘void XS_Wx__RichTextCtrl_GetLogicalPoint(PerlInterpreter*, CV*)’:
RichText.c:4275: error: ‘wxRichTextCtrl’ was not declared in this scope
RichText.c:4275: error: ‘THIS’ was not declared in this scope
RichText.c:4275: error: expected primary-expression before ‘)’ token
RichText.c:4275: error: expected `;' before ‘wxPli_sv_2_object’
RichText.c:4276: error: ‘wxPoint’ was not declared in this scope
RichText.c:4276: error: expected `;' before ‘RETVAL’
RichText.c:4277: error: expected `;' before ‘ptPhysical’
RichText.c:4279: error: ‘RETVAL’ was not declared in this scope
RichText.c:4279: error: ‘ptPhysical’ was not declared in this scope
RichText.c:4288: error: expected type-specifier before ‘wxPoint’
RichText.c:4288: error: expected `)' before ‘wxPoint’
RichText.c: In function ‘void XS_Wx__RichTextCtrl_FindNextWordPosition(PerlInterpreter*, CV*)’:
RichText.c:4306: error: ‘wxRichTextCtrl’ was not declared in this scope
RichText.c:4306: error: ‘THIS’ was not declared in this scope
RichText.c:4306: error: expected primary-expression before ‘)’ token
RichText.c:4306: error: expected `;' before ‘wxPli_sv_2_object’
RichText.c: In function ‘void XS_Wx__RichTextCtrl_IsPositionVisible(PerlInterpreter*, CV*)’:
RichText.c:4342: error: ‘wxRichTextCtrl’ was not declared in this scope
RichText.c:4342: error: ‘THIS’ was not declared in this scope
RichText.c:4342: error: expected primary-expression before ‘)’ token
RichText.c:4342: error: expected `;' before ‘wxPli_sv_2_object’
RichText.c: In function ‘void XS_Wx__RichTextCtrl_GetFirstVisiblePosition(PerlInterpreter*, CV*)’:
RichText.c:4372: error: ‘wxRichTextCtrl’ was not declared in this scope
RichText.c:4372: error: ‘THIS’ was not declared in this scope
RichText.c:4372: error: expected primary-expression before ‘)’ token
RichText.c:4372: error: expected `;' before ‘wxPli_sv_2_object’
RichText.c: In function ‘void XS_Wx__RichTextCtrl_WriteImageFile(PerlInterpreter*, CV*)’:
RichText.c:4553: error: ‘wxRichTextCtrl’ was not declared in this scope
RichText.c:4553: error: ‘THIS’ was not declared in this scope
RichText.c:4553: error: expected primary-expression before ‘)’ token
RichText.c:4553: error: expected `;' before ‘wxPli_sv_2_object’
RichText.c:4555: error: ‘wxString’ was not declared in this scope
RichText.c:4555: error: expected `;' before ‘filename’
RichText.c:4556: error: ‘wxBitmapType’ was not declared in this scope
RichText.c:4556: error: expected `;' before ‘bitmapType’
RichText.c:4558: error: ‘filename’ was not declared in this scope
RichText.c:4558: error: ‘wxConvUTF8’ was not declared in this scope
RichText.c:4558: error: ‘wxConvLocal’ was not declared in this scope
RichText.c:4560: error: ‘bitmapType’ was not declared in this scope
RichText.c: In function ‘void XS_Wx__RichTextCtrl_WriteImageBitmap(PerlInterpreter*, CV*)’:
RichText.c:4586: error: ‘wxRichTextCtrl’ was not declared in this scope
RichText.c:4586: error: ‘THIS’ was not declared in this scope
RichText.c:4586: error: expected primary-expression before ‘)’ token
RichText.c:4586: error: expected `;' before ‘wxPli_sv_2_object’
RichText.c:4588: error: ‘wxBitmap’ was not declared in this scope
RichText.c:4588: error: ‘bitmap’ was not declared in this scope
RichText.c:4588: error: expected primary-expression before ‘)’ token
RichText.c:4588: error: expected `;' before ‘wxPli_sv_2_object’
RichText.c:4589: error: ‘wxBitmapType’ was not declared in this scope
RichText.c:4589: error: expected `;' before ‘bitmapType’
RichText.c:4592: error: ‘bitmapType’ was not declared in this scope
RichText.c:4592: error: ‘wxBITMAP_TYPE_PNG’ was not declared in this scope
RichText.c:4594: error: ‘bitmapType’ was not declared in this scope
RichText.c:4597: error: ‘bitmapType’ was not declared in this scope
RichText.c: In function ‘void XS_Wx__RichTextCtrl_WriteImageImage(PerlInterpreter*, CV*)’:
RichText.c:4623: error: ‘wxRichTextCtrl’ was not declared in this scope
RichText.c:4623: error: ‘THIS’ was not declared in this scope
RichText.c:4623: error: expected primary-expression before ‘)’ token
RichText.c:4623: error: expected `;' before ‘wxPli_sv_2_object’
RichText.c:4625: error: ‘wxImage’ was not declared in this scope
RichText.c:4625: error: ‘image’ was not declared in this scope
RichText.c:4625: error: expected primary-expression before ‘)’ token
RichText.c:4625: error: expected `;' before ‘wxPli_sv_2_object’
RichText.c:4626: error: ‘wxBitmapType’ was not declared in this scope
RichText.c:4626: error: expected `;' before ‘bitmapType’
RichText.c:4629: error: ‘bitmapType’ was not declared in this scope
RichText.c:4629: error: ‘wxBITMAP_TYPE_PNG’ was not declared in this scope
RichText.c:4631: error: ‘bitmapType’ was not declared in this scope
RichText.c:4634: error: ‘bitmapType’ was not declared in this scope
RichText.c: In function ‘void XS_Wx__RichTextCtrl_SetBasicStyleRich(PerlInterpreter*, CV*)’:
RichText.c:4660: error: ‘wxRichTextCtrl’ was not declared in this scope
RichText.c:4660: error: ‘THIS’ was not declared in this scope
RichText.c:4660: error: expected primary-expression before ‘)’ token
RichText.c:4660: error: expected `;' before ‘wxPli_sv_2_object’
RichText.c:4661: error: ‘wxRichTextAttr’ was not declared in this scope
RichText.c:4661: error: ‘style’ was not declared in this scope
RichText.c:4661: error: expected primary-expression before ‘)’ token
RichText.c:4661: error: expected `;' before ‘wxPli_sv_2_object’
RichText.c: In function ‘void XS_Wx__RichTextCtrl_SetBasicStyleEx(PerlInterpreter*, CV*)’:
RichText.c:4687: error: ‘wxRichTextCtrl’ was not declared in this scope
RichText.c:4687: error: ‘THIS’ was not declared in this scope
RichText.c:4687: error: expected primary-expression before ‘)’ token
RichText.c:4687: error: expected `;' before ‘wxPli_sv_2_object’
RichText.c:4688: error: ‘wxTextAttrEx’ was not declared in this scope
RichText.c:4688: error: ‘style’ was not declared in this scope
RichText.c:4688: error: expected primary-expression before ‘)’ token
RichText.c:4688: error: expected `;' before ‘wxPli_sv_2_object’
RichText.c: In function ‘void XS_Wx__RichTextCtrl_SetBasicStyle(PerlInterpreter*, CV*)’:
RichText.c:4716: error: ‘wxRichTextCtrl’ was not declared in this scope
RichText.c:4716: error: ‘THIS’ was not declared in this scope
RichText.c:4716: error: expected primary-expression before ‘)’ token
RichText.c:4716: error: expected `;' before ‘wxPli_sv_2_object’
RichText.c: In function ‘void XS_Wx__RichTextCtrl_GetBuffer(PerlInterpreter*, CV*)’:
RichText.c:4738: error: ‘wxRichTextCtrl’ was not declared in this scope
RichText.c:4738: error: ‘THIS’ was not declared in this scope
RichText.c:4738: error: expected primary-expression before ‘)’ token
RichText.c:4738: error: expected `;' before ‘wxPli_sv_2_object’
RichText.c:4739: error: ‘wxRichTextBuffer’ was not declared in this scope
RichText.c:4739: error: ‘RETVAL’ was not declared in this scope
RichText.c: In function ‘void XS_Wx__RichTextCtrl_SetStyle(PerlInterpreter*, CV*)’:
RichText.c:4786: error: ‘wxRichTextCtrl’ was not declared in this scope
RichText.c:4786: error: ‘THIS’ was not declared in this scope
RichText.c:4786: error: expected primary-expression before ‘)’ token
RichText.c:4786: error: expected `;' before ‘wxPli_sv_2_object’
RichText.c: In function ‘void XS_Wx__RichTextCtrl_SetStyleEx(PerlInterpreter*, CV*)’:
RichText.c:4811: error: ‘wxRichTextCtrl’ was not declared in this scope
RichText.c:4811: error: ‘THIS’ was not declared in this scope
RichText.c:4811: error: expected primary-expression before ‘)’ token
RichText.c:4811: error: expected `;' before ‘wxPli_sv_2_object’
RichText.c: In function ‘void XS_Wx__RichTextCtrl_HasCharacterAttributes(PerlInterpreter*, CV*)’:
RichText.c:4836: error: ‘wxRichTextCtrl’ was not declared in this scope
RichText.c:4836: error: ‘THIS’ was not declared in this scope
RichText.c:4836: error: expected primary-expression before ‘)’ token
RichText.c:4836: error: expected `;' before ‘wxPli_sv_2_object’
RichText.c: In function ‘void XS_Wx__RichTextCtrl_HasParagraphAttributes(PerlInterpreter*, CV*)’:
RichText.c:4860: error: ‘wxRichTextCtrl’ was not declared in this scope
RichText.c:4860: error: ‘THIS’ was not declared in this scope
RichText.c:4860: error: expected primary-expression before ‘)’ token
RichText.c:4860: error: expected `;' before ‘wxPli_sv_2_object’
RichText.c: In function ‘void XS_Wx__RichTextCtrl_DeleteSelectedContent(PerlInterpreter*, CV*)’:
RichText.c:4884: error: ‘wxRichTextCtrl’ was not declared in this scope
RichText.c:4884: error: ‘THIS’ was not declared in this scope
RichText.c:4884: error: expected primary-expression before ‘)’ token
RichText.c:4884: error: expected `;' before ‘wxPli_sv_2_object’
RichText.c: In function ‘void XS_Wx__RichTextCtrl_GetCaretPositionForIndex(PerlInterpreter*, CV*)’:
RichText.c:4910: error: ‘wxRichTextCtrl’ was not declared in this scope
RichText.c:4910: error: ‘THIS’ was not declared in this scope
RichText.c:4910: error: expected primary-expression before ‘)’ token
RichText.c:4910: error: expected `;' before ‘wxPli_sv_2_object’
RichText.c:4911: error: ‘wxRect’ was not declared in this scope
RichText.c:4911: error: expected `;' before ‘rect’
RichText.c:4912: error: ‘rect’ was not declared in this scope
RichText.c:4915: error: expected type-specifier before ‘wxRect’
RichText.c:4915: error: expected `)' before ‘wxRect’
RichText.c: In function ‘void XS_Wx__RichTextCtrl_GetRichTextAttrStyle(PerlInterpreter*, CV*)’:
RichText.c:4938: error: ‘wxRichTextCtrl’ was not declared in this scope
RichText.c:4938: error: ‘THIS’ was not declared in this scope
RichText.c:4938: error: expected primary-expression before ‘)’ token
RichText.c:4938: error: expected `;' before ‘wxPli_sv_2_object’
RichText.c:4939: error: ‘wxRichTextAttr’ was not declared in this scope
RichText.c:4939: error: expected `;' before ‘attr’
RichText.c:4940: error: ‘attr’ was not declared in this scope
RichText.c:4943: error: expected type-specifier before ‘wxRichTextAttr’
RichText.c:4943: error: expected `)' before ‘wxRichTextAttr’
RichText.c: In function ‘void XS_Wx__RichTextCtrl_GetTextAttrExStyle(PerlInterpreter*, CV*)’:
RichText.c:4967: error: ‘wxRichTextCtrl’ was not declared in this scope
RichText.c:4967: error: ‘THIS’ was not declared in this scope
RichText.c:4967: error: expected primary-expression before ‘)’ token
RichText.c:4967: error: expected `;' before ‘wxPli_sv_2_object’
RichText.c:4968: error: ‘wxTextAttrEx’ was not declared in this scope
RichText.c:4968: error: expected `;' before ‘attr’
RichText.c:4969: error: ‘attr’ was not declared in this scope
RichText.c:4972: error: expected type-specifier before ‘wxTextAttrEx’
RichText.c:4972: error: expected `)' before ‘wxTextAttrEx’
RichText.c: In function ‘void XS_Wx__RichTextCtrl_GetTextAttrStyle(PerlInterpreter*, CV*)’:
RichText.c:4996: error: ‘wxRichTextCtrl’ was not declared in this scope
RichText.c:4996: error: ‘THIS’ was not declared in this scope
RichText.c:4996: error: expected primary-expression before ‘)’ token
RichText.c:4996: error: expected `;' before ‘wxPli_sv_2_object’
RichText.c:4997: error: ‘wxTextAttr’ was not declared in this scope
RichText.c:4997: error: expected `;' before ‘attr’
RichText.c:4998: error: ‘attr’ was not declared in this scope
RichText.c:5001: error: expected type-specifier before ‘wxTextAttr’
RichText.c:5001: error: expected `)' before ‘wxTextAttr’
RichText.c: In function ‘void XS_Wx__RichTextRange_newDefault(PerlInterpreter*, CV*)’:
RichText.c:5308: error: ‘wxRichTextRange’ was not declared in this scope
RichText.c:5308: error: ‘RETVAL’ was not declared in this scope
RichText.c:5310: error: expected type-specifier before ‘wxRichTextRange’
RichText.c:5310: error: expected `;' before ‘wxRichTextRange’
RichText.c: In function ‘void XS_Wx__RichTextRange_newFromTo(PerlInterpreter*, CV*)’:
RichText.c:5339: error: ‘wxRichTextRange’ was not declared in this scope
RichText.c:5339: error: ‘RETVAL’ was not declared in this scope
RichText.c:5343: error: expected type-specifier before ‘wxRichTextRange’
RichText.c:5343: error: expected `;' before ‘wxRichTextRange’
RichText.c: In function ‘void XS_Wx__RichTextRange_newCopy(PerlInterpreter*, CV*)’:
RichText.c:5372: error: ‘wxRichTextRange’ was not declared in this scope
RichText.c:5372: error: ‘RETVAL’ was not declared in this scope
RichText.c:5373: error: ‘range’ was not declared in this scope
RichText.c:5373: error: expected primary-expression before ‘)’ token
RichText.c:5373: error: expected `;' before ‘wxPli_sv_2_object’
RichText.c:5375: error: expected type-specifier before ‘wxRichTextRange’
RichText.c:5375: error: expected `;' before ‘wxRichTextRange’
RichText.c: In function ‘void XS_Wx__RichTextRange_DESTROY(PerlInterpreter*, CV*)’:
RichText.c:5421: error: ‘wxRichTextRange’ was not declared in this scope
RichText.c:5421: error: ‘THIS’ was not declared in this scope
RichText.c:5421: error: expected primary-expression before ‘)’ token
RichText.c:5421: error: expected `;' before ‘wxPli_sv_2_object’
RichText.c:5423: error: type ‘<type error>’ argument given to ‘delete’, expected pointer
RichText.c: In function ‘void XS_Wx__RichTextRange_SetRange(PerlInterpreter*, CV*)’:
RichText.c:5440: error: ‘wxRichTextRange’ was not declared in this scope
RichText.c:5440: error: ‘THIS’ was not declared in this scope
RichText.c:5440: error: expected primary-expression before ‘)’ token
RichText.c:5440: error: expected `;' before ‘wxPli_sv_2_object’
RichText.c: In function ‘void XS_Wx__RichTextRange_SetStart(PerlInterpreter*, CV*)’:
RichText.c:5468: error: ‘wxRichTextRange’ was not declared in this scope
RichText.c:5468: error: ‘THIS’ was not declared in this scope
RichText.c:5468: error: expected primary-expression before ‘)’ token
RichText.c:5468: error: expected `;' before ‘wxPli_sv_2_object’
RichText.c: In function ‘void XS_Wx__RichTextRange_GetStart(PerlInterpreter*, CV*)’:
RichText.c:5495: error: ‘wxRichTextRange’ was not declared in this scope
RichText.c:5495: error: ‘THIS’ was not declared in this scope
RichText.c:5495: error: expected primary-expression before ‘)’ token
RichText.c:5495: error: expected `;' before ‘wxPli_sv_2_object’
RichText.c: In function ‘void XS_Wx__RichTextRange_SetEnd(PerlInterpreter*, CV*)’:
RichText.c:5524: error: ‘wxRichTextRange’ was not declared in this scope
RichText.c:5524: error: ‘THIS’ was not declared in this scope
RichText.c:5524: error: expected primary-expression before ‘)’ token
RichText.c:5524: error: expected `;' before ‘wxPli_sv_2_object’
RichText.c: In function ‘void XS_Wx__RichTextRange_GetEnd(PerlInterpreter*, CV*)’:
RichText.c:5551: error: ‘wxRichTextRange’ was not declared in this scope
RichText.c:5551: error: ‘THIS’ was not declared in this scope
RichText.c:5551: error: expected primary-expression before ‘)’ token
RichText.c:5551: error: expected `;' before ‘wxPli_sv_2_object’
RichText.c: In function ‘void XS_Wx__RichTextRange_IsOutside(PerlInterpreter*, CV*)’:
RichText.c:5580: error: ‘wxRichTextRange’ was not declared in this scope
RichText.c:5580: error: ‘THIS’ was not declared in this scope
RichText.c:5580: error: expected primary-expression before ‘)’ token
RichText.c:5580: error: expected `;' before ‘wxPli_sv_2_object’
RichText.c:5582: error: ‘range’ was not declared in this scope
RichText.c:5582: error: expected primary-expression before ‘)’ token
RichText.c:5582: error: expected `;' before ‘wxPli_sv_2_object’
RichText.c: In function ‘void XS_Wx__RichTextRange_IsWithin(PerlInterpreter*, CV*)’:
RichText.c:5610: error: ‘wxRichTextRange’ was not declared in this scope
RichText.c:5610: error: ‘THIS’ was not declared in this scope
RichText.c:5610: error: expected primary-expression before ‘)’ token
RichText.c:5610: error: expected `;' before ‘wxPli_sv_2_object’
RichText.c:5612: error: ‘range’ was not declared in this scope
RichText.c:5612: error: expected primary-expression before ‘)’ token
RichText.c:5612: error: expected `;' before ‘wxPli_sv_2_object’
RichText.c: In function ‘void XS_Wx__RichTextRange_Contains(PerlInterpreter*, CV*)’:
RichText.c:5640: error: ‘wxRichTextRange’ was not declared in this scope
RichText.c:5640: error: ‘THIS’ was not declared in this scope
RichText.c:5640: error: expected primary-expression before ‘)’ token
RichText.c:5640: error: expected `;' before ‘wxPli_sv_2_object’
RichText.c: In function ‘void XS_Wx__RichTextRange_LimitTo(PerlInterpreter*, CV*)’:
RichText.c:5670: error: ‘wxRichTextRange’ was not declared in this scope
RichText.c:5670: error: ‘THIS’ was not declared in this scope
RichText.c:5670: error: expected primary-expression before ‘)’ token
RichText.c:5670: error: expected `;' before ‘wxPli_sv_2_object’
RichText.c:5672: error: ‘range’ was not declared in this scope
RichText.c:5672: error: expected primary-expression before ‘)’ token
RichText.c:5672: error: expected `;' before ‘wxPli_sv_2_object’
RichText.c: In function ‘void XS_Wx__RichTextRange_GetLength(PerlInterpreter*, CV*)’:
RichText.c:5700: error: ‘wxRichTextRange’ was not declared in this scope
RichText.c:5700: error: ‘THIS’ was not declared in this scope
RichText.c:5700: error: expected primary-expression before ‘)’ token
RichText.c:5700: error: expected `;' before ‘wxPli_sv_2_object’
RichText.c: In function ‘void XS_Wx__TextAttrEx_newDefault(PerlInterpreter*, CV*)’:
RichText.c:5755: error: ‘wxTextAttrEx’ was not declared in this scope
RichText.c:5755: error: ‘RETVAL’ was not declared in this scope
RichText.c:5757: error: expected type-specifier before ‘wxTextAttrEx’
RichText.c:5757: error: expected `;' before ‘wxTextAttrEx’
RichText.c: In function ‘void XS_Wx__TextAttrEx_newCopy(PerlInterpreter*, CV*)’:
RichText.c:5786: error: ‘wxTextAttrEx’ was not declared in this scope
RichText.c:5786: error: ‘RETVAL’ was not declared in this scope
RichText.c:5787: error: ‘attr’ was not declared in this scope
RichText.c:5787: error: expected primary-expression before ‘)’ token
RichText.c:5787: error: expected `;' before ‘wxPli_sv_2_object’
RichText.c:5789: error: expected type-specifier before ‘wxTextAttrEx’
RichText.c:5789: error: expected `;' before ‘wxTextAttrEx’
RichText.c: In function ‘void XS_Wx__TextAttrEx_newAttr(PerlInterpreter*, CV*)’:
RichText.c:5818: error: ‘wxTextAttrEx’ was not declared in this scope
RichText.c:5818: error: ‘RETVAL’ was not declared in this scope
RichText.c:5819: error: ‘wxTextAttr’ was not declared in this scope
RichText.c:5819: error: ‘attr’ was not declared in this scope
RichText.c:5819: error: expected primary-expression before ‘)’ token
RichText.c:5819: error: expected `;' before ‘wxPli_sv_2_object’
RichText.c:5821: error: expected type-specifier before ‘wxTextAttrEx’
RichText.c:5821: error: expected `;' before ‘wxTextAttrEx’
RichText.c: In function ‘void XS_Wx__TextAttrEx_DESTROY(PerlInterpreter*, CV*)’:
RichText.c:5867: error: ‘wxTextAttrEx’ was not declared in this scope
RichText.c:5867: error: ‘THIS’ was not declared in this scope
RichText.c:5867: error: expected primary-expression before ‘)’ token
RichText.c:5867: error: expected `;' before ‘wxPli_sv_2_object’
RichText.c:5869: error: type ‘<type error>’ argument given to ‘delete’, expected pointer
RichText.c: In function ‘void XS_Wx__TextAttrEx_SetCharacterStyleName(PerlInterpreter*, CV*)’:
RichText.c:5886: error: ‘wxTextAttrEx’ was not declared in this scope
RichText.c:5886: error: ‘THIS’ was not declared in this scope
RichText.c:5886: error: expected primary-expression before ‘)’ token
RichText.c:5886: error: expected `;' before ‘wxPli_sv_2_object’
RichText.c:5887: error: ‘wxString’ was not declared in this scope
RichText.c:5887: error: expected `;' before ‘name’
RichText.c:5889: error: ‘name’ was not declared in this scope
RichText.c:5889: error: ‘wxConvUTF8’ was not declared in this scope
RichText.c:5889: error: ‘wxConvLocal’ was not declared in this scope
RichText.c: In function ‘void XS_Wx__TextAttrEx_SetParagraphStyleName(PerlInterpreter*, CV*)’:
RichText.c:5915: error: ‘wxTextAttrEx’ was not declared in this scope
RichText.c:5915: error: ‘THIS’ was not declared in this scope
RichText.c:5915: error: expected primary-expression before ‘)’ token
RichText.c:5915: error: expected `;' before ‘wxPli_sv_2_object’
RichText.c:5916: error: ‘wxString’ was not declared in this scope
RichText.c:5916: error: expected `;' before ‘name’
RichText.c:5918: error: ‘name’ was not declared in this scope
RichText.c:5918: error: ‘wxConvUTF8’ was not declared in this scope
RichText.c:5918: error: ‘wxConvLocal’ was not declared in this scope
RichText.c: In function ‘void XS_Wx__TextAttrEx_SetParagraphSpacingAfter(PerlInterpreter*, CV*)’:
RichText.c:5978: error: ‘wxTextAttrEx’ was not declared in this scope
RichText.c:5978: error: ‘THIS’ was not declared in this scope
RichText.c:5978: error: expected primary-expression before ‘)’ token
RichText.c:5978: error: expected `;' before ‘wxPli_sv_2_object’
RichText.c: In function ‘void XS_Wx__TextAttrEx_SetParagraphSpacingBefore(PerlInterpreter*, CV*)’:
RichText.c:6005: error: ‘wxTextAttrEx’ was not declared in this scope
RichText.c:6005: error: ‘THIS’ was not declared in this scope
RichText.c:6005: error: expected primary-expression before ‘)’ token
RichText.c:6005: error: expected `;' before ‘wxPli_sv_2_object’
RichText.c: In function ‘void XS_Wx__TextAttrEx_SetLineSpacing(PerlInterpreter*, CV*)’:
RichText.c:6032: error: ‘wxTextAttrEx’ was not declared in this scope
RichText.c:6032: error: ‘THIS’ was not declared in this scope
RichText.c:6032: error: expected primary-expression before ‘)’ token
RichText.c:6032: error: expected `;' before ‘wxPli_sv_2_object’
RichText.c: In function ‘void XS_Wx__TextAttrEx_SetBulletStyle(PerlInterpreter*, CV*)’:
RichText.c:6059: error: ‘wxTextAttrEx’ was not declared in this scope
RichText.c:6059: error: ‘THIS’ was not declared in this scope
RichText.c:6059: error: expected primary-expression before ‘)’ token
RichText.c:6059: error: expected `;' before ‘wxPli_sv_2_object’
RichText.c: In function ‘void XS_Wx__TextAttrEx_SetBulletNumber(PerlInterpreter*, CV*)’:
RichText.c:6086: error: ‘wxTextAttrEx’ was not declared in this scope
RichText.c:6086: error: ‘THIS’ was not declared in this scope
RichText.c:6086: error: expected primary-expression before ‘)’ token
RichText.c:6086: error: expected `;' before ‘wxPli_sv_2_object’
RichText.c: In function ‘void XS_Wx__TextAttrEx_GetCharacterStyleName(PerlInterpreter*, CV*)’:
RichText.c:6267: error: ‘wxTextAttrEx’ was not declared in this scope
RichText.c:6267: error: ‘THIS’ was not declared in this scope
RichText.c:6267: error: expected primary-expression before ‘)’ token
RichText.c:6267: error: expected `;' before ‘wxPli_sv_2_object’
RichText.c:6268: error: ‘wxString’ was not declared in this scope
RichText.c:6268: error: expected `;' before ‘RETVAL’
RichText.c:6270: error: ‘RETVAL’ was not declared in this scope
RichText.c:6279: error: ‘RETVAL’ was not declared in this scope
RichText.c: In function ‘void XS_Wx__TextAttrEx_GetParagraphStyleName(PerlInterpreter*, CV*)’:
RichText.c:6297: error: ‘wxTextAttrEx’ was not declared in this scope
RichText.c:6297: error: ‘THIS’ was not declared in this scope
RichText.c:6297: error: expected primary-expression before ‘)’ token
RichText.c:6297: error: expected `;' before ‘wxPli_sv_2_object’
RichText.c:6298: error: ‘wxString’ was not declared in this scope
RichText.c:6298: error: expected `;' before ‘RETVAL’
RichText.c:6300: error: ‘RETVAL’ was not declared in this scope
RichText.c:6309: error: ‘RETVAL’ was not declared in this scope
RichText.c: In function ‘void XS_Wx__TextAttrEx_GetParagraphSpacingAfter(PerlInterpreter*, CV*)’:
RichText.c:6362: error: ‘wxTextAttrEx’ was not declared in this scope
RichText.c:6362: error: ‘THIS’ was not declared in this scope
RichText.c:6362: error: expected primary-expression before ‘)’ token
RichText.c:6362: error: expected `;' before ‘wxPli_sv_2_object’
RichText.c: In function ‘void XS_Wx__TextAttrEx_GetParagraphSpacingBefore(PerlInterpreter*, CV*)’:
RichText.c:6391: error: ‘wxTextAttrEx’ was not declared in this scope
RichText.c:6391: error: ‘THIS’ was not declared in this scope
RichText.c:6391: error: expected primary-expression before ‘)’ token
RichText.c:6391: error: expected `;' before ‘wxPli_sv_2_object’
RichText.c: In function ‘void XS_Wx__TextAttrEx_GetLineSpacing(PerlInterpreter*, CV*)’:
RichText.c:6420: error: ‘wxTextAttrEx’ was not declared in this scope
RichText.c:6420: error: ‘THIS’ was not declared in this scope
RichText.c:6420: error: expected primary-expression before ‘)’ token
RichText.c:6420: error: expected `;' before ‘wxPli_sv_2_object’
RichText.c: In function ‘void XS_Wx__TextAttrEx_GetBulletStyle(PerlInterpreter*, CV*)’:
RichText.c:6449: error: ‘wxTextAttrEx’ was not declared in this scope
RichText.c:6449: error: ‘THIS’ was not declared in this scope
RichText.c:6449: error: expected primary-expression before ‘)’ token
RichText.c:6449: error: expected `;' before ‘wxPli_sv_2_object’
RichText.c: In function ‘void XS_Wx__TextAttrEx_GetBulletNumber(PerlInterpreter*, CV*)’:
RichText.c:6478: error: ‘wxTextAttrEx’ was not declared in this scope
RichText.c:6478: error: ‘THIS’ was not declared in this scope
RichText.c:6478: error: expected primary-expression before ‘)’ token
RichText.c:6478: error: expected `;' before ‘wxPli_sv_2_object’
RichText.c: In function ‘void XS_Wx__TextAttrEx_HasWeight(PerlInterpreter*, CV*)’:
RichText.c:6636: error: ‘wxTextAttrEx’ was not declared in this scope
RichText.c:6636: error: ‘THIS’ was not declared in this scope
RichText.c:6636: error: expected primary-expression before ‘)’ token
RichText.c:6636: error: expected `;' before ‘wxPli_sv_2_object’
RichText.c: In function ‘void XS_Wx__TextAttrEx_HasSize(PerlInterpreter*, CV*)’:
RichText.c:6665: error: ‘wxTextAttrEx’ was not declared in this scope
RichText.c:6665: error: ‘THIS’ was not declared in this scope
RichText.c:6665: error: expected primary-expression before ‘)’ token
RichText.c:6665: error: expected `;' before ‘wxPli_sv_2_object’
RichText.c: In function ‘void XS_Wx__TextAttrEx_HasItalic(PerlInterpreter*, CV*)’:
RichText.c:6694: error: ‘wxTextAttrEx’ was not declared in this scope
RichText.c:6694: error: ‘THIS’ was not declared in this scope
RichText.c:6694: error: expected primary-expression before ‘)’ token
RichText.c:6694: error: expected `;' before ‘wxPli_sv_2_object’
RichText.c: In function ‘void XS_Wx__TextAttrEx_HasUnderlined(PerlInterpreter*, CV*)’:
RichText.c:6723: error: ‘wxTextAttrEx’ was not declared in this scope
RichText.c:6723: error: ‘THIS’ was not declared in this scope
RichText.c:6723: error: expected primary-expression before ‘)’ token
RichText.c:6723: error: expected `;' before ‘wxPli_sv_2_object’
RichText.c: In function ‘void XS_Wx__TextAttrEx_HasFaceName(PerlInterpreter*, CV*)’:
RichText.c:6752: error: ‘wxTextAttrEx’ was not declared in this scope
RichText.c:6752: error: ‘THIS’ was not declared in this scope
RichText.c:6752: error: expected primary-expression before ‘)’ token
RichText.c:6752: error: expected `;' before ‘wxPli_sv_2_object’
RichText.c: In function ‘void XS_Wx__TextAttrEx_HasParagraphSpacingAfter(PerlInterpreter*, CV*)’:
RichText.c:6782: error: ‘wxTextAttrEx’ was not declared in this scope
RichText.c:6782: error: ‘THIS’ was not declared in this scope
RichText.c:6782: error: expected primary-expression before ‘)’ token
RichText.c:6782: error: expected `;' before ‘wxPli_sv_2_object’
RichText.c: In function ‘void XS_Wx__TextAttrEx_HasParagraphSpacingBefore(PerlInterpreter*, CV*)’:
RichText.c:6811: error: ‘wxTextAttrEx’ was not declared in this scope
RichText.c:6811: error: ‘THIS’ was not declared in this scope
RichText.c:6811: error: expected primary-expression before ‘)’ token
RichText.c:6811: error: expected `;' before ‘wxPli_sv_2_object’
RichText.c: In function ‘void XS_Wx__TextAttrEx_HasLineSpacing(PerlInterpreter*, CV*)’:
RichText.c:6840: error: ‘wxTextAttrEx’ was not declared in this scope
RichText.c:6840: error: ‘THIS’ was not declared in this scope
RichText.c:6840: error: expected primary-expression before ‘)’ token
RichText.c:6840: error: expected `;' before ‘wxPli_sv_2_object’
RichText.c: In function ‘void XS_Wx__TextAttrEx_HasCharacterStyleName(PerlInterpreter*, CV*)’:
RichText.c:6869: error: ‘wxTextAttrEx’ was not declared in this scope
RichText.c:6869: error: ‘THIS’ was not declared in this scope
RichText.c:6869: error: expected primary-expression before ‘)’ token
RichText.c:6869: error: expected `;' before ‘wxPli_sv_2_object’
RichText.c: In function ‘void XS_Wx__TextAttrEx_HasParagraphStyleName(PerlInterpreter*, CV*)’:
RichText.c:6898: error: ‘wxTextAttrEx’ was not declared in this scope
RichText.c:6898: error: ‘THIS’ was not declared in this scope
RichText.c:6898: error: expected primary-expression before ‘)’ token
RichText.c:6898: error: expected `;' before ‘wxPli_sv_2_object’
RichText.c: In function ‘void XS_Wx__TextAttrEx_HasBulletStyle(PerlInterpreter*, CV*)’:
RichText.c:6961: error: ‘wxTextAttrEx’ was not declared in this scope
RichText.c:6961: error: ‘THIS’ was not declared in this scope
RichText.c:6961: error: expected primary-expression before ‘)’ token
RichText.c:6961: error: expected `;' before ‘wxPli_sv_2_object’
RichText.c: In function ‘void XS_Wx__TextAttrEx_HasBulletNumber(PerlInterpreter*, CV*)’:
RichText.c:6990: error: ‘wxTextAttrEx’ was not declared in this scope
RichText.c:6990: error: ‘THIS’ was not declared in this scope
RichText.c:6990: error: expected primary-expression before ‘)’ token
RichText.c:6990: error: expected `;' before ‘wxPli_sv_2_object’
RichText.c: In function ‘void XS_Wx__TextAttrEx_IsCharacterStyle(PerlInterpreter*, CV*)’:
RichText.c:7140: error: ‘wxTextAttrEx’ was not declared in this scope
RichText.c:7140: error: ‘THIS’ was not declared in this scope
RichText.c:7140: error: expected primary-expression before ‘)’ token
RichText.c:7140: error: expected `;' before ‘wxPli_sv_2_object’
RichText.c: In function ‘void XS_Wx__TextAttrEx_IsParagraphStyle(PerlInterpreter*, CV*)’:
RichText.c:7169: error: ‘wxTextAttrEx’ was not declared in this scope
RichText.c:7169: error: ‘THIS’ was not declared in this scope
RichText.c:7169: error: expected primary-expression before ‘)’ token
RichText.c:7169: error: expected `;' before ‘wxPli_sv_2_object’
RichText.c: In function ‘void XS_Wx__TextAttrEx_IsDefault(PerlInterpreter*, CV*)’:
RichText.c:7198: error: ‘wxTextAttrEx’ was not declared in this scope
RichText.c:7198: error: ‘THIS’ was not declared in this scope
RichText.c:7198: error: expected primary-expression before ‘)’ token
RichText.c:7198: error: expected `;' before ‘wxPli_sv_2_object’
RichText.c: In function ‘void XS_Wx__RichTextAttr_newDefault(PerlInterpreter*, CV*)’:
RichText.c:7514: error: ‘wxRichTextAttr’ was not declared in this scope
RichText.c:7514: error: ‘RETVAL’ was not declared in this scope
RichText.c:7516: error: expected type-specifier before ‘wxRichTextAttr’
RichText.c:7516: error: expected `;' before ‘wxRichTextAttr’
RichText.c: In function ‘void XS_Wx__RichTextAttr_newCopy(PerlInterpreter*, CV*)’:
RichText.c:7545: error: ‘wxRichTextAttr’ was not declared in this scope
RichText.c:7545: error: ‘RETVAL’ was not declared in this scope
RichText.c:7546: error: ‘attr’ was not declared in this scope
RichText.c:7546: error: expected primary-expression before ‘)’ token
RichText.c:7546: error: expected `;' before ‘wxPli_sv_2_object’
RichText.c:7548: error: expected type-specifier before ‘wxRichTextAttr’
RichText.c:7548: error: expected `;' before ‘wxRichTextAttr’
RichText.c: In function ‘void XS_Wx__RichTextAttr_newAttrEx(PerlInterpreter*, CV*)’:
RichText.c:7577: error: ‘wxRichTextAttr’ was not declared in this scope
RichText.c:7577: error: ‘RETVAL’ was not declared in this scope
RichText.c:7578: error: ‘wxTextAttrEx’ was not declared in this scope
RichText.c:7578: error: ‘attr’ was not declared in this scope
RichText.c:7578: error: expected primary-expression before ‘)’ token
RichText.c:7578: error: expected `;' before ‘wxPli_sv_2_object’
RichText.c:7580: error: expected type-specifier before ‘wxRichTextAttr’
RichText.c:7580: error: expected `;' before ‘wxRichTextAttr’
RichText.c: In function ‘void XS_Wx__RichTextAttr_newAttr(PerlInterpreter*, CV*)’:
RichText.c:7609: error: ‘wxRichTextAttr’ was not declared in this scope
RichText.c:7609: error: ‘RETVAL’ was not declared in this scope
RichText.c:7610: error: ‘wxTextAttr’ was not declared in this scope
RichText.c:7610: error: ‘attr’ was not declared in this scope
RichText.c:7610: error: expected primary-expression before ‘)’ token
RichText.c:7610: error: expected `;' before ‘wxPli_sv_2_object’
RichText.c:7612: error: expected type-specifier before ‘wxRichTextAttr’
RichText.c:7612: error: expected `;' before ‘wxRichTextAttr’
RichText.c: In function ‘void XS_Wx__RichTextAttr_newFull(PerlInterpreter*, CV*)’:
RichText.c:7702: error: ‘wxRichTextAttr’ was not declared in this scope
RichText.c:7702: error: ‘RETVAL’ was not declared in this scope
RichText.c:7703: error: ‘wxColour’ was not declared in this scope
RichText.c:7703: error: ‘colText’ was not declared in this scope
RichText.c:7703: error: expected primary-expression before ‘)’ token
RichText.c:7703: error: expected `;' before ‘wxPli_sv_2_object’
RichText.c:7704: error: ‘colBack’ was not declared in this scope
RichText.c:7705: error: ‘wxTextAttrAlignment’ was not declared in this scope
RichText.c:7705: error: expected `;' before ‘alignment’
RichText.c:7708: error: expected primary-expression before ‘)’ token
RichText.c:7708: error: ‘wxNullColour’ was not declared in this scope
RichText.c:7710: error: expected primary-expression before ‘)’ token
RichText.c:7710: error: expected `;' before ‘wxPli_sv_2_object’
RichText.c:7714: error: ‘alignment’ was not declared in this scope
RichText.c:7714: error: ‘wxTEXT_ALIGNMENT_DEFAULT’ was not declared in this scope
RichText.c:7716: error: ‘alignment’ was not declared in this scope
RichText.c:7719: error: expected type-specifier before ‘wxRichTextAttr’
RichText.c:7719: error: expected `;' before ‘wxRichTextAttr’
RichText.c: In function ‘void XS_Wx__RichTextAttr_DESTROY(PerlInterpreter*, CV*)’:
RichText.c:7766: error: ‘wxRichTextAttr’ was not declared in this scope
RichText.c:7766: error: ‘THIS’ was not declared in this scope
RichText.c:7766: error: expected primary-expression before ‘)’ token
RichText.c:7766: error: expected `;' before ‘wxPli_sv_2_object’
RichText.c:7768: error: type ‘<type error>’ argument given to ‘delete’, expected pointer
RichText.c: In function ‘void XS_Wx__RichTextAttr_CreateFont(PerlInterpreter*, CV*)’:
RichText.c:7789: error: ‘wxRichTextAttr’ was not declared in this scope
RichText.c:7789: error: ‘THIS’ was not declared in this scope
RichText.c:7789: error: expected primary-expression before ‘)’ token
RichText.c:7789: error: expected `;' before ‘wxPli_sv_2_object’
RichText.c:7790: error: ‘wxFont’ was not declared in this scope
RichText.c:7790: error: ‘RETVAL’ was not declared in this scope
RichText.c:7792: error: expected type-specifier before ‘wxFont’
RichText.c:7792: error: expected `;' before ‘wxFont’
RichText.c: In function ‘void XS_Wx__RichTextAttr_GetFontAttributes(PerlInterpreter*, CV*)’:
RichText.c:7821: error: ‘wxRichTextAttr’ was not declared in this scope
RichText.c:7821: error: ‘THIS’ was not declared in this scope
RichText.c:7821: error: expected primary-expression before ‘)’ token
RichText.c:7821: error: expected `;' before ‘wxPli_sv_2_object’
RichText.c:7823: error: ‘wxFont’ was not declared in this scope
RichText.c:7823: error: ‘font’ was not declared in this scope
RichText.c:7823: error: expected primary-expression before ‘)’ token
RichText.c:7823: error: expected `;' before ‘wxPli_sv_2_object’
RichText.c: In function ‘void XS_Wx__RichTextAttr_SetTextColour(PerlInterpreter*, CV*)’:
RichText.c:7851: error: ‘wxRichTextAttr’ was not declared in this scope
RichText.c:7851: error: ‘THIS’ was not declared in this scope
RichText.c:7851: error: expected primary-expression before ‘)’ token
RichText.c:7851: error: expected `;' before ‘wxPli_sv_2_object’
RichText.c:7852: error: ‘wxColour’ was not declared in this scope
RichText.c:7852: error: ‘colText’ was not declared in this scope
RichText.c:7852: error: expected primary-expression before ‘)’ token
RichText.c:7852: error: expected `;' before ‘wxPli_sv_2_object’
RichText.c: In function ‘void XS_Wx__RichTextAttr_SetBackgroundColour(PerlInterpreter*, CV*)’:
RichText.c:7878: error: ‘wxRichTextAttr’ was not declared in this scope
RichText.c:7878: error: ‘THIS’ was not declared in this scope
RichText.c:7878: error: expected primary-expression before ‘)’ token
RichText.c:7878: error: expected `;' before ‘wxPli_sv_2_object’
RichText.c:7879: error: ‘wxColour’ was not declared in this scope
RichText.c:7879: error: ‘colBack’ was not declared in this scope
RichText.c:7879: error: expected primary-expression before ‘)’ token
RichText.c:7879: error: expected `;' before ‘wxPli_sv_2_object’
RichText.c: In function ‘void XS_Wx__RichTextAttr_SetAlignment(PerlInterpreter*, CV*)’:
RichText.c:7905: error: ‘wxRichTextAttr’ was not declared in this scope
RichText.c:7905: error: ‘THIS’ was not declared in this scope
RichText.c:7905: error: expected primary-expression before ‘)’ token
RichText.c:7905: error: expected `;' before ‘wxPli_sv_2_object’
RichText.c:7906: error: ‘wxTextAttrAlignment’ was not declared in this scope
RichText.c:7906: error: expected `;' before ‘alignment’
RichText.c:7908: error: ‘alignment’ was not declared in this scope
RichText.c: In function ‘void XS_Wx__RichTextAttr_SetTabs(PerlInterpreter*, CV*)’:
RichText.c:7932: error: ‘wxRichTextAttr’ was not declared in this scope
RichText.c:7932: error: ‘THIS’ was not declared in this scope
RichText.c:7932: error: expected primary-expression before ‘)’ token
RichText.c:7932: error: expected `;' before ‘wxPli_sv_2_object’
RichText.c:7933: error: ‘wxArrayInt’ was not declared in this scope
RichText.c:7933: error: expected `;' before ‘tabs’
RichText.c:7935: error: ‘tabs’ was not declared in this scope
RichText.c: In function ‘void XS_Wx__RichTextAttr_SetLeftIndent(PerlInterpreter*, CV*)’:
RichText.c:7961: error: ‘wxRichTextAttr’ was not declared in this scope
RichText.c:7961: error: ‘THIS’ was not declared in this scope
RichText.c:7961: error: expected primary-expression before ‘)’ token
RichText.c:7961: error: expected `;' before ‘wxPli_sv_2_object’
RichText.c: In function ‘void XS_Wx__RichTextAttr_SetRightIndent(PerlInterpreter*, CV*)’:
RichText.c:7995: error: ‘wxRichTextAttr’ was not declared in this scope
RichText.c:7995: error: ‘THIS’ was not declared in this scope
RichText.c:7995: error: expected primary-expression before ‘)’ token
RichText.c:7995: error: expected `;' before ‘wxPli_sv_2_object’
RichText.c: In function ‘void XS_Wx__RichTextAttr_SetFontSize(PerlInterpreter*, CV*)’:
RichText.c:8022: error: ‘wxRichTextAttr’ was not declared in this scope
RichText.c:8022: error: ‘THIS’ was not declared in this scope
RichText.c:8022: error: expected primary-expression before ‘)’ token
RichText.c:8022: error: expected `;' before ‘wxPli_sv_2_object’
RichText.c: In function ‘void XS_Wx__RichTextAttr_SetFontStyle(PerlInterpreter*, CV*)’:
RichText.c:8049: error: ‘wxRichTextAttr’ was not declared in this scope
RichText.c:8049: error: ‘THIS’ was not declared in this scope
RichText.c:8049: error: expected primary-expression before ‘)’ token
RichText.c:8049: error: expected `;' before ‘wxPli_sv_2_object’
RichText.c:8050: error: ‘wxFontStyle’ was not declared in this scope
RichText.c:8050: error: expected `;' before ‘fontStyle’
RichText.c:8052: error: ‘fontStyle’ was not declared in this scope
RichText.c: In function ‘void XS_Wx__RichTextAttr_SetFontWeight(PerlInterpreter*, CV*)’:
RichText.c:8076: error: ‘wxRichTextAttr’ was not declared in this scope
RichText.c:8076: error: ‘THIS’ was not declared in this scope
RichText.c:8076: error: expected primary-expression before ‘)’ token
RichText.c:8076: error: expected `;' before ‘wxPli_sv_2_object’
RichText.c:8077: error: ‘wxFontWeight’ was not declared in this scope
RichText.c:8077: error: expected `;' before ‘fontWeight’
RichText.c:8079: error: ‘fontWeight’ was not declared in this scope
RichText.c: In function ‘void XS_Wx__RichTextAttr_SetFontFaceName(PerlInterpreter*, CV*)’:
RichText.c:8103: error: ‘wxRichTextAttr’ was not declared in this scope
RichText.c:8103: error: ‘THIS’ was not declared in this scope
RichText.c:8103: error: expected primary-expression before ‘)’ token
RichText.c:8103: error: expected `;' before ‘wxPli_sv_2_object’
RichText.c:8104: error: ‘wxString’ was not declared in this scope
RichText.c:8104: error: expected `;' before ‘faceName’
RichText.c:8106: error: ‘faceName’ was not declared in this scope
RichText.c:8106: error: ‘wxConvUTF8’ was not declared in this scope
RichText.c:8106: error: ‘wxConvLocal’ was not declared in this scope
RichText.c: In function ‘void XS_Wx__RichTextAttr_SetFontUnderlined(PerlInterpreter*, CV*)’:
RichText.c:8132: error: ‘wxRichTextAttr’ was not declared in this scope
RichText.c:8132: error: ‘THIS’ was not declared in this scope
RichText.c:8132: error: expected primary-expression before ‘)’ token
RichText.c:8132: error: expected `;' before ‘wxPli_sv_2_object’
RichText.c: In function ‘void XS_Wx__RichTextAttr_SetFlags(PerlInterpreter*, CV*)’:
RichText.c:8159: error: ‘wxRichTextAttr’ was not declared in this scope
RichText.c:8159: error: ‘THIS’ was not declared in this scope
RichText.c:8159: error: expected primary-expression before ‘)’ token
RichText.c:8159: error: expected `;' before ‘wxPli_sv_2_object’
RichText.c: In function ‘void XS_Wx__RichTextAttr_SetCharacterStyleName(PerlInterpreter*, CV*)’:
RichText.c:8186: error: ‘wxRichTextAttr’ was not declared in this scope
RichText.c:8186: error: ‘THIS’ was not declared in this scope
RichText.c:8186: error: expected primary-expression before ‘)’ token
RichText.c:8186: error: expected `;' before ‘wxPli_sv_2_object’
RichText.c:8187: error: ‘wxString’ was not declared in this scope
RichText.c:8187: error: expected `;' before ‘name’
RichText.c:8189: error: ‘name’ was not declared in this scope
RichText.c:8189: error: ‘wxConvUTF8’ was not declared in this scope
RichText.c:8189: error: ‘wxConvLocal’ was not declared in this scope
RichText.c: In function ‘void XS_Wx__RichTextAttr_SetParagraphStyleName(PerlInterpreter*, CV*)’:
RichText.c:8215: error: ‘wxRichTextAttr’ was not declared in this scope
RichText.c:8215: error: ‘THIS’ was not declared in this scope
RichText.c:8215: error: expected primary-expression before ‘)’ token
RichText.c:8215: error: expected `;' before ‘wxPli_sv_2_object’
RichText.c:8216: error: ‘wxString’ was not declared in this scope
RichText.c:8216: error: expected `;' before ‘name’
RichText.c:8218: error: ‘name’ was not declared in this scope
RichText.c:8218: error: ‘wxConvUTF8’ was not declared in this scope
RichText.c:8218: error: ‘wxConvLocal’ was not declared in this scope
RichText.c: In function ‘void XS_Wx__RichTextAttr_SetParagraphSpacingAfter(PerlInterpreter*, CV*)’:
RichText.c:8278: error: ‘wxRichTextAttr’ was not declared in this scope
RichText.c:8278: error: ‘THIS’ was not declared in this scope
RichText.c:8278: error: expected primary-expression before ‘)’ token
RichText.c:8278: error: expected `;' before ‘wxPli_sv_2_object’
RichText.c: In function ‘void XS_Wx__RichTextAttr_SetParagraphSpacingBefore(PerlInterpreter*, CV*)’:
RichText.c:8305: error: ‘wxRichTextAttr’ was not declared in this scope
RichText.c:8305: error: ‘THIS’ was not declared in this scope
RichText.c:8305: error: expected primary-expression before ‘)’ token
RichText.c:8305: error: expected `;' before ‘wxPli_sv_2_object’
RichText.c: In function ‘void XS_Wx__RichTextAttr_SetLineSpacing(PerlInterpreter*, CV*)’:
RichText.c:8332: error: ‘wxRichTextAttr’ was not declared in this scope
RichText.c:8332: error: ‘THIS’ was not declared in this scope
RichText.c:8332: error: expected primary-expression before ‘)’ token
RichText.c:8332: error: expected `;' before ‘wxPli_sv_2_object’
RichText.c: In function ‘void XS_Wx__RichTextAttr_SetBulletStyle(PerlInterpreter*, CV*)’:
RichText.c:8359: error: ‘wxRichTextAttr’ was not declared in this scope
RichText.c:8359: error: ‘THIS’ was not declared in this scope
RichText.c:8359: error: expected primary-expression before ‘)’ token
RichText.c:8359: error: expected `;' before ‘wxPli_sv_2_object’
RichText.c: In function ‘void XS_Wx__RichTextAttr_SetBulletNumber(PerlInterpreter*, CV*)’:
RichText.c:8386: error: ‘wxRichTextAttr’ was not declared in this scope
RichText.c:8386: error: ‘THIS’ was not declared in this scope
RichText.c:8386: error: expected primary-expression before ‘)’ token
RichText.c:8386: error: expected `;' before ‘wxPli_sv_2_object’
RichText.c: In function ‘void XS_Wx__RichTextAttr_GetTextColour(PerlInterpreter*, CV*)’:
RichText.c:8567: error: ‘wxRichTextAttr’ was not declared in this scope
RichText.c:8567: error: ‘THIS’ was not declared in this scope
RichText.c:8567: error: expected primary-expression before ‘)’ token
RichText.c:8567: error: expected `;' before ‘wxPli_sv_2_object’
RichText.c:8568: error: ‘wxColour’ was not declared in this scope
RichText.c:8568: error: ‘RETVAL’ was not declared in this scope
RichText.c:8570: error: expected type-specifier before ‘wxColour’
RichText.c:8570: error: expected `;' before ‘wxColour’
RichText.c: In function ‘void XS_Wx__RichTextAttr_GetBackgroundColour(PerlInterpreter*, CV*)’:
RichText.c:8598: error: ‘wxRichTextAttr’ was not declared in this scope
RichText.c:8598: error: ‘THIS’ was not declared in this scope
RichText.c:8598: error: expected primary-expression before ‘)’ token
RichText.c:8598: error: expected `;' before ‘wxPli_sv_2_object’
RichText.c:8599: error: ‘wxColour’ was not declared in this scope
RichText.c:8599: error: ‘RETVAL’ was not declared in this scope
RichText.c:8601: error: expected type-specifier before ‘wxColour’
RichText.c:8601: error: expected `;' before ‘wxColour’
RichText.c: In function ‘void XS_Wx__RichTextAttr_GetAlignment(PerlInterpreter*, CV*)’:
RichText.c:8629: error: ‘wxRichTextAttr’ was not declared in this scope
RichText.c:8629: error: ‘THIS’ was not declared in this scope
RichText.c:8629: error: expected primary-expression before ‘)’ token
RichText.c:8629: error: expected `;' before ‘wxPli_sv_2_object’
RichText.c:8630: error: ‘wxTextAttrAlignment’ was not declared in this scope
RichText.c:8630: error: expected `;' before ‘RETVAL’
RichText.c:8633: error: ‘RETVAL’ was not declared in this scope
RichText.c:8641: error: ‘RETVAL’ was not declared in this scope
RichText.c: In function ‘void XS_Wx__RichTextAttr_GetLeftIndent(PerlInterpreter*, CV*)’:
RichText.c:8658: error: ‘wxRichTextAttr’ was not declared in this scope
RichText.c:8658: error: ‘THIS’ was not declared in this scope
RichText.c:8658: error: expected primary-expression before ‘)’ token
RichText.c:8658: error: expected `;' before ‘wxPli_sv_2_object’
RichText.c: In function ‘void XS_Wx__RichTextAttr_GetLeftSubIndent(PerlInterpreter*, CV*)’:
RichText.c:8687: error: ‘wxRichTextAttr’ was not declared in this scope
RichText.c:8687: error: ‘THIS’ was not declared in this scope
RichText.c:8687: error: expected primary-expression before ‘)’ token
RichText.c:8687: error: expected `;' before ‘wxPli_sv_2_object’
RichText.c: In function ‘void XS_Wx__RichTextAttr_GetRightIndent(PerlInterpreter*, CV*)’:
RichText.c:8716: error: ‘wxRichTextAttr’ was not declared in this scope
RichText.c:8716: error: ‘THIS’ was not declared in this scope
RichText.c:8716: error: expected primary-expression before ‘)’ token
RichText.c:8716: error: expected `;' before ‘wxPli_sv_2_object’
RichText.c: In function ‘void XS_Wx__RichTextAttr_GetFlags(PerlInterpreter*, CV*)’:
RichText.c:8745: error: ‘wxRichTextAttr’ was not declared in this scope
RichText.c:8745: error: ‘THIS’ was not declared in this scope
RichText.c:8745: error: expected primary-expression before ‘)’ token
RichText.c:8745: error: expected `;' before ‘wxPli_sv_2_object’
RichText.c: In function ‘void XS_Wx__RichTextAttr_GetFontSize(PerlInterpreter*, CV*)’:
RichText.c:8774: error: ‘wxRichTextAttr’ was not declared in this scope
RichText.c:8774: error: ‘THIS’ was not declared in this scope
RichText.c:8774: error: expected primary-expression before ‘)’ token
RichText.c:8774: error: expected `;' before ‘wxPli_sv_2_object’
RichText.c: In function ‘void XS_Wx__RichTextAttr_GetFontStyle(PerlInterpreter*, CV*)’:
RichText.c:8869: error: ‘wxRichTextAttr’ was not declared in this scope
RichText.c:8869: error: ‘THIS’ was not declared in this scope
RichText.c:8869: error: expected primary-expression before ‘)’ token
RichText.c:8869: error: expected `;' before ‘wxPli_sv_2_object’
RichText.c: In function ‘void XS_Wx__RichTextAttr_GetFontWeight(PerlInterpreter*, CV*)’:
RichText.c:8898: error: ‘wxRichTextAttr’ was not declared in this scope
RichText.c:8898: error: ‘THIS’ was not declared in this scope
RichText.c:8898: error: expected primary-expression before ‘)’ token
RichText.c:8898: error: expected `;' before ‘wxPli_sv_2_object’
RichText.c: In function ‘void XS_Wx__RichTextAttr_GetFontUnderlined(PerlInterpreter*, CV*)’:
RichText.c:8928: error: ‘wxRichTextAttr’ was not declared in this scope
RichText.c:8928: error: ‘THIS’ was not declared in this scope
RichText.c:8928: error: expected primary-expression before ‘)’ token
RichText.c:8928: error: expected `;' before ‘wxPli_sv_2_object’
RichText.c: In function ‘void XS_Wx__RichTextAttr_GetFontFaceName(PerlInterpreter*, CV*)’:
RichText.c:8957: error: ‘wxRichTextAttr’ was not declared in this scope
RichText.c:8957: error: ‘THIS’ was not declared in this scope
RichText.c:8957: error: expected primary-expression before ‘)’ token
RichText.c:8957: error: expected `;' before ‘wxPli_sv_2_object’
RichText.c:8958: error: ‘wxString’ was not declared in this scope
RichText.c:8958: error: expected `;' before ‘RETVAL’
RichText.c:8960: error: ‘RETVAL’ was not declared in this scope
RichText.c:8969: error: ‘RETVAL’ was not declared in this scope
RichText.c: In function ‘void XS_Wx__RichTextAttr_GetCharacterStyleName(PerlInterpreter*, CV*)’:
RichText.c:8987: error: ‘wxRichTextAttr’ was not declared in this scope
RichText.c:8987: error: ‘THIS’ was not declared in this scope
RichText.c:8987: error: expected primary-expression before ‘)’ token
RichText.c:8987: error: expected `;' before ‘wxPli_sv_2_object’
RichText.c:8988: error: ‘wxString’ was not declared in this scope
RichText.c:8988: error: expected `;' before ‘RETVAL’
RichText.c:8990: error: ‘RETVAL’ was not declared in this scope
RichText.c:8999: error: ‘RETVAL’ was not declared in this scope
RichText.c: In function ‘void XS_Wx__RichTextAttr_GetParagraphStyleName(PerlInterpreter*, CV*)’:
RichText.c:9017: error: ‘wxRichTextAttr’ was not declared in this scope
RichText.c:9017: error: ‘THIS’ was not declared in this scope
RichText.c:9017: error: expected primary-expression before ‘)’ token
RichText.c:9017: error: expected `;' before ‘wxPli_sv_2_object’
RichText.c:9018: error: ‘wxString’ was not declared in this scope
RichText.c:9018: error: expected `;' before ‘RETVAL’
RichText.c:9020: error: ‘RETVAL’ was not declared in this scope
RichText.c:9029: error: ‘RETVAL’ was not declared in this scope
RichText.c: In function ‘void XS_Wx__RichTextAttr_GetParagraphSpacingAfter(PerlInterpreter*, CV*)’:
RichText.c:9082: error: ‘wxRichTextAttr’ was not declared in this scope
RichText.c:9082: error: ‘THIS’ was not declared in this scope
RichText.c:9082: error: expected primary-expression before ‘)’ token
RichText.c:9082: error: expected `;' before ‘wxPli_sv_2_object’
RichText.c: In function ‘void XS_Wx__RichTextAttr_GetParagraphSpacingBefore(PerlInterpreter*, CV*)’:
RichText.c:9111: error: ‘wxRichTextAttr’ was not declared in this scope
RichText.c:9111: error: ‘THIS’ was not declared in this scope
RichText.c:9111: error: expected primary-expression before ‘)’ token
RichText.c:9111: error: expected `;' before ‘wxPli_sv_2_object’
RichText.c: In function ‘void XS_Wx__RichTextAttr_GetLineSpacing(PerlInterpreter*, CV*)’:
RichText.c:9140: error: ‘wxRichTextAttr’ was not declared in this scope
RichText.c:9140: error: ‘THIS’ was not declared in this scope
RichText.c:9140: error: expected primary-expression before ‘)’ token
RichText.c:9140: error: expected `;' before ‘wxPli_sv_2_object’
RichText.c: In function ‘void XS_Wx__RichTextAttr_GetBulletStyle(PerlInterpreter*, CV*)’:
RichText.c:9169: error: ‘wxRichTextAttr’ was not declared in this scope
RichText.c:9169: error: ‘THIS’ was not declared in this scope
RichText.c:9169: error: expected primary-expression before ‘)’ token
RichText.c:9169: error: expected `;' before ‘wxPli_sv_2_object’
RichText.c: In function ‘void XS_Wx__RichTextAttr_GetBulletNumber(PerlInterpreter*, CV*)’:
RichText.c:9198: error: ‘wxRichTextAttr’ was not declared in this scope
RichText.c:9198: error: ‘THIS’ was not declared in this scope
RichText.c:9198: error: expected primary-expression before ‘)’ token
RichText.c:9198: error: expected `;' before ‘wxPli_sv_2_object’
RichText.c: In function ‘void XS_Wx__RichTextAttr_HasTextColour(PerlInterpreter*, CV*)’:
RichText.c:9352: error: ‘wxRichTextAttr’ was not declared in this scope
RichText.c:9352: error: ‘THIS’ was not declared in this scope
RichText.c:9352: error: expected primary-expression before ‘)’ token
RichText.c:9352: error: expected `;' before ‘wxPli_sv_2_object’
RichText.c: In function ‘void XS_Wx__RichTextAttr_HasBackgroundColour(PerlInterpreter*, CV*)’:
RichText.c:9381: error: ‘wxRichTextAttr’ was not declared in this scope
RichText.c:9381: error: ‘THIS’ was not declared in this scope
RichText.c:9381: error: expected primary-expression before ‘)’ token
RichText.c:9381: error: expected `;' before ‘wxPli_sv_2_object’
RichText.c: In function ‘void XS_Wx__RichTextAttr_HasAlignment(PerlInterpreter*, CV*)’:
RichText.c:9410: error: ‘wxRichTextAttr’ was not declared in this scope
RichText.c:9410: error: ‘THIS’ was not declared in this scope
RichText.c:9410: error: expected primary-expression before ‘)’ token
RichText.c:9410: error: expected `;' before ‘wxPli_sv_2_object’
RichText.c: In function ‘void XS_Wx__RichTextAttr_HasTabs(PerlInterpreter*, CV*)’:
RichText.c:9439: error: ‘wxRichTextAttr’ was not declared in this scope
RichText.c:9439: error: ‘THIS’ was not declared in this scope
RichText.c:9439: error: expected primary-expression before ‘)’ token
RichText.c:9439: error: expected `;' before ‘wxPli_sv_2_object’
RichText.c: In function ‘void XS_Wx__RichTextAttr_HasLeftIndent(PerlInterpreter*, CV*)’:
RichText.c:9468: error: ‘wxRichTextAttr’ was not declared in this scope
RichText.c:9468: error: ‘THIS’ was not declared in this scope
RichText.c:9468: error: expected primary-expression before ‘)’ token
RichText.c:9468: error: expected `;' before ‘wxPli_sv_2_object’
RichText.c: In function ‘void XS_Wx__RichTextAttr_HasRightIndent(PerlInterpreter*, CV*)’:
RichText.c:9497: error: ‘wxRichTextAttr’ was not declared in this scope
RichText.c:9497: error: ‘THIS’ was not declared in this scope
RichText.c:9497: error: expected primary-expression before ‘)’ token
RichText.c:9497: error: expected `;' before ‘wxPli_sv_2_object’
RichText.c: In function ‘void XS_Wx__RichTextAttr_HasWeight(PerlInterpreter*, CV*)’:
RichText.c:9530: error: ‘wxRichTextAttr’ was not declared in this scope
RichText.c:9530: error: ‘THIS’ was not declared in this scope
RichText.c:9530: error: expected primary-expression before ‘)’ token
RichText.c:9530: error: expected `;' before ‘wxPli_sv_2_object’
RichText.c: In function ‘void XS_Wx__RichTextAttr_HasSize(PerlInterpreter*, CV*)’:
RichText.c:9559: error: ‘wxRichTextAttr’ was not declared in this scope
RichText.c:9559: error: ‘THIS’ was not declared in this scope
RichText.c:9559: error: expected primary-expression before ‘)’ token
RichText.c:9559: error: expected `;' before ‘wxPli_sv_2_object’
RichText.c: In function ‘void XS_Wx__RichTextAttr_HasItalic(PerlInterpreter*, CV*)’:
RichText.c:9588: error: ‘wxRichTextAttr’ was not declared in this scope
RichText.c:9588: error: ‘THIS’ was not declared in this scope
RichText.c:9588: error: expected primary-expression before ‘)’ token
RichText.c:9588: error: expected `;' before ‘wxPli_sv_2_object’
RichText.c: In function ‘void XS_Wx__RichTextAttr_HasUnderlined(PerlInterpreter*, CV*)’:
RichText.c:9617: error: ‘wxRichTextAttr’ was not declared in this scope
RichText.c:9617: error: ‘THIS’ was not declared in this scope
RichText.c:9617: error: expected primary-expression before ‘)’ token
RichText.c:9617: error: expected `;' before ‘wxPli_sv_2_object’
RichText.c: In function ‘void XS_Wx__RichTextAttr_HasFaceName(PerlInterpreter*, CV*)’:
RichText.c:9646: error: ‘wxRichTextAttr’ was not declared in this scope
RichText.c:9646: error: ‘THIS’ was not declared in this scope
RichText.c:9646: error: expected primary-expression before ‘)’ token
RichText.c:9646: error: expected `;' before ‘wxPli_sv_2_object’
RichText.c: In function ‘void XS_Wx__RichTextAttr_HasFont(PerlInterpreter*, CV*)’:
RichText.c:9676: error: ‘wxRichTextAttr’ was not declared in this scope
RichText.c:9676: error: ‘THIS’ was not declared in this scope
RichText.c:9676: error: expected primary-expression before ‘)’ token
RichText.c:9676: error: expected `;' before ‘wxPli_sv_2_object’
RichText.c: In function ‘void XS_Wx__RichTextAttr_HasParagraphSpacingAfter(PerlInterpreter*, CV*)’:
RichText.c:9705: error: ‘wxRichTextAttr’ was not declared in this scope
RichText.c:9705: error: ‘THIS’ was not declared in this scope
RichText.c:9705: error: expected primary-expression before ‘)’ token
RichText.c:9705: error: expected `;' before ‘wxPli_sv_2_object’
RichText.c: In function ‘void XS_Wx__RichTextAttr_HasParagraphSpacingBefore(PerlInterpreter*, CV*)’:
RichText.c:9734: error: ‘wxRichTextAttr’ was not declared in this scope
RichText.c:9734: error: ‘THIS’ was not declared in this scope
RichText.c:9734: error: expected primary-expression before ‘)’ token
RichText.c:9734: error: expected `;' before ‘wxPli_sv_2_object’
RichText.c: In function ‘void XS_Wx__RichTextAttr_HasLineSpacing(PerlInterpreter*, CV*)’:
RichText.c:9763: error: ‘wxRichTextAttr’ was not declared in this scope
RichText.c:9763: error: ‘THIS’ was not declared in this scope
RichText.c:9763: error: expected primary-expression before ‘)’ token
RichText.c:9763: error: expected `;' before ‘wxPli_sv_2_object’
RichText.c: In function ‘void XS_Wx__RichTextAttr_HasCharacterStyleName(PerlInterpreter*, CV*)’:
RichText.c:9792: error: ‘wxRichTextAttr’ was not declared in this scope
RichText.c:9792: error: ‘THIS’ was not declared in this scope
RichText.c:9792: error: expected primary-expression before ‘)’ token
RichText.c:9792: error: expected `;' before ‘wxPli_sv_2_object’
RichText.c: In function ‘void XS_Wx__RichTextAttr_HasParagraphStyleName(PerlInterpreter*, CV*)’:
RichText.c:9821: error: ‘wxRichTextAttr’ was not declared in this scope
RichText.c:9821: error: ‘THIS’ was not declared in this scope
RichText.c:9821: error: expected primary-expression before ‘)’ token
RichText.c:9821: error: expected `;' before ‘wxPli_sv_2_object’
RichText.c: In function ‘void XS_Wx__RichTextAttr_HasBulletStyle(PerlInterpreter*, CV*)’:
RichText.c:9884: error: ‘wxRichTextAttr’ was not declared in this scope
RichText.c:9884: error: ‘THIS’ was not declared in this scope
RichText.c:9884: error: expected primary-expression before ‘)’ token
RichText.c:9884: error: expected `;' before ‘wxPli_sv_2_object’
RichText.c: In function ‘void XS_Wx__RichTextAttr_HasBulletNumber(PerlInterpreter*, CV*)’:
RichText.c:9913: error: ‘wxRichTextAttr’ was not declared in this scope
RichText.c:9913: error: ‘THIS’ was not declared in this scope
RichText.c:9913: error: expected primary-expression before ‘)’ token
RichText.c:9913: error: expected `;' before ‘wxPli_sv_2_object’
RichText.c: In function ‘void XS_Wx__RichTextAttr_IsCharacterStyle(PerlInterpreter*, CV*)’:
RichText.c:10063: error: ‘wxRichTextAttr’ was not declared in this scope
RichText.c:10063: error: ‘THIS’ was not declared in this scope
RichText.c:10063: error: expected primary-expression before ‘)’ token
RichText.c:10063: error: expected `;' before ‘wxPli_sv_2_object’
RichText.c: In function ‘void XS_Wx__RichTextAttr_IsParagraphStyle(PerlInterpreter*, CV*)’:
RichText.c:10092: error: ‘wxRichTextAttr’ was not declared in this scope
RichText.c:10092: error: ‘THIS’ was not declared in this scope
RichText.c:10092: error: expected primary-expression before ‘)’ token
RichText.c:10092: error: expected `;' before ‘wxPli_sv_2_object’
RichText.c: In function ‘void XS_Wx__RichTextAttr_IsDefault(PerlInterpreter*, CV*)’:
RichText.c:10121: error: ‘wxRichTextAttr’ was not declared in this scope
RichText.c:10121: error: ‘THIS’ was not declared in this scope
RichText.c:10121: error: expected primary-expression before ‘)’ token
RichText.c:10121: error: expected `;' before ‘wxPli_sv_2_object’
RichText.c: In function ‘void XS_Wx__RichTextAttr_GetTabs(PerlInterpreter*, CV*)’:
RichText.c:10179: error: ‘wxRichTextAttr’ was not declared in this scope
RichText.c:10179: error: ‘THIS’ was not declared in this scope
RichText.c:10179: error: expected primary-expression before ‘)’ token
RichText.c:10179: error: expected `;' before ‘wxPli_sv_2_object’
RichText.c:10180: error: expected initializer before ‘&’ token
RichText.c:10182: error: ‘tabs’ was not declared in this scope
RichText.c: In function ‘void XS_Wx__RichTextStyleDefinition_DESTROY(PerlInterpreter*, CV*)’:
RichText.c:10228: error: ‘wxRichTextStyleDefinition’ was not declared in this scope
RichText.c:10228: error: ‘THIS’ was not declared in this scope
RichText.c:10228: error: expected primary-expression before ‘)’ token
RichText.c:10228: error: expected `;' before ‘wxPli_sv_2_object’
RichText.c:10231: error: type ‘<type error>’ argument given to ‘delete’, expected pointer
RichText.c: In function ‘void XS_Wx__RichTextStyleDefinition_SetName(PerlInterpreter*, CV*)’:
RichText.c:10310: error: ‘wxRichTextStyleDefinition’ was not declared in this scope
RichText.c:10310: error: ‘THIS’ was not declared in this scope
RichText.c:10310: error: expected primary-expression before ‘)’ token
RichText.c:10310: error: expected `;' before ‘wxPli_sv_2_object’
RichText.c:10311: error: ‘wxString’ was not declared in this scope
RichText.c:10311: error: expected `;' before ‘name’
RichText.c:10313: error: ‘name’ was not declared in this scope
RichText.c:10313: error: ‘wxConvUTF8’ was not declared in this scope
RichText.c:10313: error: ‘wxConvLocal’ was not declared in this scope
RichText.c: In function ‘void XS_Wx__RichTextStyleDefinition_GetName(PerlInterpreter*, CV*)’:
RichText.c:10339: error: ‘wxRichTextStyleDefinition’ was not declared in this scope
RichText.c:10339: error: ‘THIS’ was not declared in this scope
RichText.c:10339: error: expected primary-expression before ‘)’ token
RichText.c:10339: error: expected `;' before ‘wxPli_sv_2_object’
RichText.c:10340: error: ‘wxString’ was not declared in this scope
RichText.c:10340: error: expected `;' before ‘RETVAL’
RichText.c:10342: error: ‘RETVAL’ was not declared in this scope
RichText.c:10351: error: ‘RETVAL’ was not declared in this scope
RichText.c: In function ‘void XS_Wx__RichTextStyleDefinition_SetBaseStyle(PerlInterpreter*, CV*)’:
RichText.c:10433: error: ‘wxRichTextStyleDefinition’ was not declared in this scope
RichText.c:10433: error: ‘THIS’ was not declared in this scope
RichText.c:10433: error: expected primary-expression before ‘)’ token
RichText.c:10433: error: expected `;' before ‘wxPli_sv_2_object’
RichText.c:10434: error: ‘wxString’ was not declared in this scope
RichText.c:10434: error: expected `;' before ‘name’
RichText.c:10436: error: ‘name’ was not declared in this scope
RichText.c:10436: error: ‘wxConvUTF8’ was not declared in this scope
RichText.c:10436: error: ‘wxConvLocal’ was not declared in this scope
RichText.c: In function ‘void XS_Wx__RichTextStyleDefinition_GetBaseStyle(PerlInterpreter*, CV*)’:
RichText.c:10462: error: ‘wxRichTextStyleDefinition’ was not declared in this scope
RichText.c:10462: error: ‘THIS’ was not declared in this scope
RichText.c:10462: error: expected primary-expression before ‘)’ token
RichText.c:10462: error: expected `;' before ‘wxPli_sv_2_object’
RichText.c:10463: error: ‘wxString’ was not declared in this scope
RichText.c:10463: error: expected `;' before ‘RETVAL’
RichText.c:10465: error: ‘RETVAL’ was not declared in this scope
RichText.c:10474: error: ‘RETVAL’ was not declared in this scope
RichText.c: In function ‘void XS_Wx__RichTextStyleDefinition_SetStyle(PerlInterpreter*, CV*)’:
RichText.c:10492: error: ‘wxRichTextStyleDefinition’ was not declared in this scope
RichText.c:10492: error: ‘THIS’ was not declared in this scope
RichText.c:10492: error: expected primary-expression before ‘)’ token
RichText.c:10492: error: expected `;' before ‘wxPli_sv_2_object’
RichText.c:10493: error: ‘wxRichTextAttr’ was not declared in this scope
RichText.c:10493: error: ‘style’ was not declared in this scope
RichText.c:10493: error: expected primary-expression before ‘)’ token
RichText.c:10493: error: expected `;' before ‘wxPli_sv_2_object’
RichText.c: In function ‘void XS_Wx__RichTextStyleDefinition_GetStyle(PerlInterpreter*, CV*)’:
RichText.c:10519: error: ‘wxRichTextStyleDefinition’ was not declared in this scope
RichText.c:10519: error: ‘THIS’ was not declared in this scope
RichText.c:10519: error: expected primary-expression before ‘)’ token
RichText.c:10519: error: expected `;' before ‘wxPli_sv_2_object’
RichText.c:10520: error: ‘wxRichTextAttr’ was not declared in this scope
RichText.c:10520: error: ‘RETVAL’ was not declared in this scope
RichText.c:10522: error: expected type-specifier before ‘wxRichTextAttr’
RichText.c:10522: error: expected `;' before ‘wxRichTextAttr’
RichText.c: In function ‘void XS_Wx__RichTextCharacterStyleDefinition_new(PerlInterpreter*, CV*)’:
RichText.c:10588: error: ‘wxRichTextCharacterStyleDefinition’ was not declared in this scope
RichText.c:10588: error: ‘RETVAL’ was not declared in this scope
RichText.c:10589: error: ‘wxString’ was not declared in this scope
RichText.c:10589: error: expected `;' before ‘name’
RichText.c:10592: error: ‘name’ was not declared in this scope
RichText.c:10592: error: ‘wxEmptyString’ was not declared in this scope
RichText.c:10594: error: ‘name’ was not declared in this scope
RichText.c:10594: error: ‘wxConvUTF8’ was not declared in this scope
RichText.c:10594: error: ‘wxConvLocal’ was not declared in this scope
RichText.c:10597: error: expected type-specifier before ‘wxRichTextCharacterStyleDefinition’
RichText.c:10597: error: expected `;' before ‘wxRichTextCharacterStyleDefinition’
RichText.c: In function ‘void XS_Wx__RichTextParagraphStyleDefinition_new(PerlInterpreter*, CV*)’:
RichText.c:10626: error: ‘wxRichTextParagraphStyleDefinition’ was not declared in this scope
RichText.c:10626: error: ‘RETVAL’ was not declared in this scope
RichText.c:10627: error: ‘wxString’ was not declared in this scope
RichText.c:10627: error: expected `;' before ‘name’
RichText.c:10630: error: ‘name’ was not declared in this scope
RichText.c:10630: error: ‘wxEmptyString’ was not declared in this scope
RichText.c:10632: error: ‘name’ was not declared in this scope
RichText.c:10632: error: ‘wxConvUTF8’ was not declared in this scope
RichText.c:10632: error: ‘wxConvLocal’ was not declared in this scope
RichText.c:10635: error: expected type-specifier before ‘wxRichTextParagraphStyleDefinition’
RichText.c:10635: error: expected `;' before ‘wxRichTextParagraphStyleDefinition’
RichText.c: In function ‘void XS_Wx__RichTextParagraphStyleDefinition_SetNextStyle(PerlInterpreter*, CV*)’:
RichText.c:10695: error: ‘wxRichTextParagraphStyleDefinition’ was not declared in this scope
RichText.c:10695: error: ‘THIS’ was not declared in this scope
RichText.c:10695: error: expected primary-expression before ‘)’ token
RichText.c:10695: error: expected `;' before ‘wxPli_sv_2_object’
RichText.c:10696: error: ‘wxString’ was not declared in this scope
RichText.c:10696: error: expected `;' before ‘name’
RichText.c:10698: error: ‘name’ was not declared in this scope
RichText.c:10698: error: ‘wxConvUTF8’ was not declared in this scope
RichText.c:10698: error: ‘wxConvLocal’ was not declared in this scope
RichText.c: In function ‘void XS_Wx__RichTextParagraphStyleDefinition_GetNextStyle(PerlInterpreter*, CV*)’:
RichText.c:10724: error: ‘wxRichTextParagraphStyleDefinition’ was not declared in this scope
RichText.c:10724: error: ‘THIS’ was not declared in this scope
RichText.c:10724: error: expected primary-expression before ‘)’ token
RichText.c:10724: error: expected `;' before ‘wxPli_sv_2_object’
RichText.c:10725: error: ‘wxString’ was not declared in this scope
RichText.c:10725: error: expected `;' before ‘RETVAL’
RichText.c:10727: error: ‘RETVAL’ was not declared in this scope
RichText.c:10736: error: ‘RETVAL’ was not declared in this scope
RichText.c: In function ‘void XS_Wx__RichTextStyleSheet_new(PerlInterpreter*, CV*)’:
RichText.c:11109: error: ‘wxRichTextStyleSheet’ was not declared in this scope
RichText.c:11109: error: ‘RETVAL’ was not declared in this scope
RichText.c:11111: error: expected type-specifier before ‘wxRichTextStyleSheet’
RichText.c:11111: error: expected `;' before ‘wxRichTextStyleSheet’
RichText.c: In function ‘void XS_Wx__RichTextStyleSheet_DESTROY(PerlInterpreter*, CV*)’:
RichText.c:11157: error: ‘wxRichTextStyleSheet’ was not declared in this scope
RichText.c:11157: error: ‘THIS’ was not declared in this scope
RichText.c:11157: error: expected primary-expression before ‘)’ token
RichText.c:11157: error: expected `;' before ‘wxPli_sv_2_object’
RichText.c:11160: error: type ‘<type error>’ argument given to ‘delete’, expected pointer
RichText.c: In function ‘void XS_Wx__RichTextStyleSheet_AddCharacterStyle(PerlInterpreter*, CV*)’:
RichText.c:11317: error: ‘wxRichTextStyleSheet’ was not declared in this scope
RichText.c:11317: error: ‘THIS’ was not declared in this scope
RichText.c:11317: error: expected primary-expression before ‘)’ token
RichText.c:11317: error: expected `;' before ‘wxPli_sv_2_object’
RichText.c:11319: error: ‘wxRichTextCharacterStyleDefinition’ was not declared in this scope
RichText.c:11319: error: ‘def’ was not declared in this scope
RichText.c:11319: error: expected primary-expression before ‘)’ token
RichText.c:11319: error: expected `;' before ‘wxPli_sv_2_object’
RichText.c: In function ‘void XS_Wx__RichTextStyleSheet_AddParagraphStyle(PerlInterpreter*, CV*)’:
RichText.c:11348: error: ‘wxRichTextStyleSheet’ was not declared in this scopemake[2]: Leaving directory `/home/cpan/pit/rel/conf/perl-5.13.0/.cpanplus/5.13.0/build/Wx-0.9702/ext/richtext'
make[1]: Leaving directory `/home/cpan/pit/rel/conf/perl-5.13.0/.cpanplus/5.13.0/build/Wx-0.9702/ext'

RichText.c:11348: error: ‘THIS’ was not declared in this scope
RichText.c:11348: error: expected primary-expression before ‘)’ token
RichText.c:11348: error: expected `;' before ‘wxPli_sv_2_object’
RichText.c:11350: error: ‘wxRichTextParagraphStyleDefinition’ was not declared in this scope
RichText.c:11350: error: ‘def’ was not declared in this scope
RichText.c:11350: error: expected primary-expression before ‘)’ token
RichText.c:11350: error: expected `;' before ‘wxPli_sv_2_object’
RichText.c: In function ‘void XS_Wx__RichTextStyleSheet_RemoveCharacterStyle(PerlInterpreter*, CV*)’:
RichText.c:11415: error: ‘wxRichTextStyleSheet’ was not declared in this scope
RichText.c:11415: error: ‘THIS’ was not declared in this scope
RichText.c:11415: error: expected primary-expression before ‘)’ token
RichText.c:11415: error: expected `;' before ‘wxPli_sv_2_object’
RichText.c:11417: error: ‘wxRichTextStyleDefinition’ was not declared in this scope
RichText.c:11417: error: ‘def’ was not declared in this scope
RichText.c:11417: error: expected primary-expression before ‘)’ token
RichText.c:11417: error: expected `;' before ‘wxPli_sv_2_object’
RichText.c: In function ‘void XS_Wx__RichTextStyleSheet_RemoveParagraphStyle(PerlInterpreter*, CV*)’:
RichText.c:11452: error: ‘wxRichTextStyleSheet’ was not declared in this scope
RichText.c:11452: error: ‘THIS’ was not declared in this scope
RichText.c:11452: error: expected primary-expression before ‘)’ token
RichText.c:11452: error: expected `;' before ‘wxPli_sv_2_object’
RichText.c:11454: error: ‘wxRichTextStyleDefinition’ was not declared in this scope
RichText.c:11454: error: ‘def’ was not declared in this scope
RichText.c:11454: error: expected primary-expression before ‘)’ token
RichText.c:11454: error: expected `;' before ‘wxPli_sv_2_object’
RichText.c: In function ‘void XS_Wx__RichTextStyleSheet_GetCharacterStyleCount(PerlInterpreter*, CV*)’:
RichText.c:11662: error: ‘wxRichTextStyleSheet’ was not declared in this scope
RichText.c:11662: error: ‘THIS’ was not declared in this scope
RichText.c:11662: error: expected primary-expression before ‘)’ token
RichText.c:11662: error: expected `;' before ‘wxPli_sv_2_object’
RichText.c: In function ‘void XS_Wx__RichTextStyleSheet_GetParagraphStyleCount(PerlInterpreter*, CV*)’:
RichText.c:11691: error: ‘wxRichTextStyleSheet’ was not declared in this scope
RichText.c:11691: error: ‘THIS’ was not declared in this scope
RichText.c:11691: error: expected primary-expression before ‘)’ token
RichText.c:11691: error: expected `;' before ‘wxPli_sv_2_object’
RichText.c: In function ‘void XS_Wx__RichTextStyleSheet_GetCharacterStyle(PerlInterpreter*, CV*)’:
RichText.c:11754: error: ‘wxRichTextStyleSheet’ was not declared in this scope
RichText.c:11754: error: ‘THIS’ was not declared in this scope
RichText.c:11754: error: expected primary-expression before ‘)’ token
RichText.c:11754: error: expected `;' before ‘wxPli_sv_2_object’
RichText.c:11755: error: ‘wxRichTextCharacterStyleDefinition’ was not declared in this scope
RichText.c:11755: error: ‘RETVAL’ was not declared in this scope
RichText.c: In function ‘void XS_Wx__RichTextStyleSheet_GetParagraphStyle(PerlInterpreter*, CV*)’:
RichText.c:11787: error: ‘wxRichTextStyleSheet’ was not declared in this scope
RichText.c:11787: error: ‘THIS’ was not declared in this scope
RichText.c:11787: error: expected primary-expression before ‘)’ token
RichText.c:11787: error: expected `;' before ‘wxPli_sv_2_object’
RichText.c:11788: error: ‘wxRichTextParagraphStyleDefinition’ was not declared in this scope
RichText.c:11788: error: ‘RETVAL’ was not declared in this scope
RichText.c: In function ‘void XS_Wx__RichTextStyleSheet_DeleteStyles(PerlInterpreter*, CV*)’:
RichText.c:11858: error: ‘wxRichTextStyleSheet’ was not declared in this scope
RichText.c:11858: error: ‘THIS’ was not declared in this scope
RichText.c:11858: error: expected primary-expression before ‘)’ token
RichText.c:11858: error: expected `;' before ‘wxPli_sv_2_object’
RichText.c: In function ‘void XS_Wx__RichTextStyleListBox_newFull(PerlInterpreter*, CV*)’:
RichText.c:12262: error: ‘wxRichTextStyleListBox’ was not declared in this scope
RichText.c:12262: error: ‘RETVAL’ was not declared in this scope
RichText.c:12263: error: ‘wxWindow’ was not declared in this scope
RichText.c:12263: error: ‘parent’ was not declared in this scope
RichText.c:12263: error: expected primary-expression before ‘)’ token
RichText.c:12263: error: expected `;' before ‘wxPli_sv_2_object’
RichText.c:12264: error: ‘wxWindowID’ was not declared in this scope
RichText.c:12264: error: expected `;' before ‘id’
RichText.c:12265: error: ‘wxPoint’ was not declared in this scope
RichText.c:12265: error: expected `;' before ‘pos’
RichText.c:12266: error: ‘wxSize’ was not declared in this scope
RichText.c:12266: error: expected `;' before ‘size’
RichText.c:12270: error: ‘id’ was not declared in this scope
RichText.c:12270: error: ‘wxID_ANY’ was not declared in this scope
RichText.c:12272: error: ‘id’ was not declared in this scope
RichText.c:12272: error: ‘wxPli_get_wxwindowid’ was not declared in this scope
RichText.c:12276: error: ‘pos’ was not declared in this scope
RichText.c:12276: error: ‘wxDefaultPosition’ was not declared in this scope
RichText.c:12278: error: ‘pos’ was not declared in this scope
RichText.c:12278: error: ‘wxPli_sv_2_wxpoint’ was not declared in this scope
RichText.c:12282: error: ‘size’ was not declared in this scope
RichText.c:12282: error: ‘wxDefaultSize’ was not declared in this scope
RichText.c:12284: error: ‘size’ was not declared in this scope
RichText.c:12284: error: ‘wxPli_sv_2_wxsize’ was not declared in this scope
RichText.c:12293: error: expected type-specifier before ‘wxRichTextStyleListBox’
RichText.c:12293: error: expected `;' before ‘wxRichTextStyleListBox’
RichText.c: In function ‘void XS_Wx__RichTextStyleListBox_Create(PerlInterpreter*, CV*)’:
RichText.c:12344: error: ‘wxRichTextStyleListBox’ was not declared in this scope
RichText.c:12344: error: ‘THIS’ was not declared in this scope
RichText.c:12344: error: expected primary-expression before ‘)’ token
RichText.c:12344: error: expected `;' before ‘wxPli_sv_2_object’
RichText.c:12346: error: ‘wxWindow’ was not declared in this scope
RichText.c:12346: error: ‘parent’ was not declared in this scope
RichText.c:12346: error: expected primary-expression before ‘)’ token
RichText.c:12346: error: expected `;' before ‘wxPli_sv_2_object’
RichText.c:12347: error: ‘wxWindowID’ was not declared in this scope
RichText.c:12347: error: expected `;' before ‘id’
RichText.c:12348: error: ‘wxPoint’ was not declared in this scope
RichText.c:12348: error: expected `;' before ‘pos’
RichText.c:12349: error: ‘wxSize’ was not declared in this scope
RichText.c:12349: error: expected `;' before ‘size’
RichText.c:12353: error: ‘id’ was not declared in this scope
RichText.c:12353: error: ‘wxID_ANY’ was not declared in this scope
RichText.c:12355: error: ‘id’ was not declared in this scope
RichText.c:12355: error: ‘wxPli_get_wxwindowid’ was not declared in this scope
RichText.c:12359: error: ‘pos’ was not declared in this scope
RichText.c:12359: error: ‘wxDefaultPosition’ was not declared in this scope
RichText.c:12361: error: ‘pos’ was not declared in this scope
RichText.c:12361: error: ‘wxPli_sv_2_wxpoint’ was not declared in this scope
RichText.c:12365: error: ‘size’ was not declared in this scope
RichText.c:12365: error: ‘wxDefaultSize’ was not declared in this scope
RichText.c:12367: error: ‘size’ was not declared in this scope
RichText.c:12367: error: ‘wxPli_sv_2_wxsize’ was not declared in this scope
RichText.c:12376: error: ‘id’ was not declared in this scope
RichText.c:12376: error: ‘pos’ was not declared in this scope
RichText.c:12376: error: ‘size’ was not declared in this scope
RichText.c: In function ‘void XS_Wx__RichTextStyleListBox_SetStyleSheet(PerlInterpreter*, CV*)’:
RichText.c:12402: error: ‘wxRichTextStyleListBox’ was not declared in this scope
RichText.c:12402: error: ‘THIS’ was not declared in this scope
RichText.c:12402: error: expected primary-expression before ‘)’ token
RichText.c:12402: error: expected `;' before ‘wxPli_sv_2_object’
RichText.c:12403: error: ‘wxRichTextStyleSheet’ was not declared in this scope
RichText.c:12403: error: ‘styleSheet’ was not declared in this scope
RichText.c:12403: error: expected primary-expression before ‘)’ token
RichText.c:12403: error: expected `;' before ‘wxPli_sv_2_object’
RichText.c: In function ‘void XS_Wx__RichTextStyleListBox_GetStyleSheet(PerlInterpreter*, CV*)’:
RichText.c:12429: error: ‘wxRichTextStyleListBox’ was not declared in this scope
RichText.c:12429: error: ‘THIS’ was not declared in this scope
RichText.c:12429: error: expected primary-expression before ‘)’ token
RichText.c:12429: error: expected `;' before ‘wxPli_sv_2_object’
RichText.c:12430: error: ‘wxRichTextStyleSheet’ was not declared in this scope
RichText.c:12430: error: ‘RETVAL’ was not declared in this scope
RichText.c: In function ‘void XS_Wx__RichTextStyleListBox_SetRichTextCtrl(PerlInterpreter*, CV*)’:
RichText.c:12461: error: ‘wxRichTextStyleListBox’ was not declared in this scope
RichText.c:12461: error: ‘THIS’ was not declared in this scope
RichText.c:12461: error: expected primary-expression before ‘)’ token
RichText.c:12461: error: expected `;' before ‘wxPli_sv_2_object’
RichText.c:12462: error: ‘wxRichTextCtrl’ was not declared in this scope
RichText.c:12462: error: ‘ctrl’ was not declared in this scope
RichText.c:12462: error: expected primary-expression before ‘)’ token
RichText.c:12462: error: expected `;' before ‘wxPli_sv_2_object’
RichText.c: In function ‘void XS_Wx__RichTextStyleListBox_GetRichTextCtrl(PerlInterpreter*, CV*)’:
RichText.c:12488: error: ‘wxRichTextStyleListBox’ was not declared in this scope
RichText.c:12488: error: ‘THIS’ was not declared in this scope
RichText.c:12488: error: expected primary-expression before ‘)’ token
RichText.c:12488: error: expected `;' before ‘wxPli_sv_2_object’
RichText.c:12489: error: ‘wxRichTextCtrl’ was not declared in this scope
RichText.c:12489: error: ‘RETVAL’ was not declared in this scope
RichText.c: In function ‘void XS_Wx__RichTextStyleListBox_GetStyle(PerlInterpreter*, CV*)’:
RichText.c:12518: error: ‘wxRichTextStyleListBox’ was not declared in this scope
RichText.c:12518: error: ‘THIS’ was not declared in this scope
RichText.c:12518: error: expected primary-expression before ‘)’ token
RichText.c:12518: error: expected `;' before ‘wxPli_sv_2_object’
RichText.c:12519: error: ‘wxRichTextStyleDefinition’ was not declared in this scope
RichText.c:12519: error: ‘RETVAL’ was not declared in this scope
RichText.c: In function ‘void XS_Wx__RichTextStyleListBox_UpdateStyles(PerlInterpreter*, CV*)’:
RichText.c:12620: error: ‘wxRichTextStyleListBox’ was not declared in this scope
RichText.c:12620: error: ‘THIS’ was not declared in this scope
RichText.c:12620: error: expected primary-expression before ‘)’ token
RichText.c:12620: error: expected `;' before ‘wxPli_sv_2_object’
RichText.c: In function ‘void XS_Wx__RichTextStyleListBox_ConvertTenthsMMToPixels(PerlInterpreter*, CV*)’:
RichText.c:12795: error: ‘wxRichTextStyleListBox’ was not declared in this scope
RichText.c:12795: error: ‘THIS’ was not declared in this scope
RichText.c:12795: error: expected primary-expression before ‘)’ token
RichText.c:12795: error: expected `;' before ‘wxPli_sv_2_object’
RichText.c:12798: error: ‘wxDC’ was not declared in this scope
RichText.c:12798: error: ‘dc’ was not declared in this scope
RichText.c:12798: error: expected primary-expression before ‘)’ token
RichText.c:12798: error: expected `;' before ‘wxPli_sv_2_object’
RichText.c: In function ‘void XS_Wx__RichTextStyleListBox_CreateHTML(PerlInterpreter*, CV*)’:
RichText.c:12826: error: ‘wxRichTextStyleListBox’ was not declared in this scope
RichText.c:12826: error: ‘THIS’ was not declared in this scope
RichText.c:12826: error: expected primary-expression before ‘)’ token
RichText.c:12826: error: expected `;' before ‘wxPli_sv_2_object’
RichText.c:12827: error: ‘wxString’ was not declared in this scope
RichText.c:12827: error: expected `;' before ‘RETVAL’
RichText.c:12828: error: ‘wxRichTextStyleDefinition’ was not declared in this scope
RichText.c:12828: error: ‘def’ was not declared in this scope
RichText.c:12828: error: expected primary-expression before ‘)’ token
RichText.c:12828: error: expected `;' before ‘wxPli_sv_2_object’
RichText.c:12830: error: ‘RETVAL’ was not declared in this scope
RichText.c:12839: error: ‘RETVAL’ was not declared in this scope
RichText.c: In function ‘void XS_Wx__RichTextFormattingDialog_newDefault(PerlInterpreter*, CV*)’:
RichText.c:13681: error: ‘wxRichTextFormattingDialog’ was not declared in this scope
RichText.c:13681: error: ‘RETVAL’ was not declared in this scope
RichText.c:13683: error: expected type-specifier before ‘wxRichTextFormattingDialog’
RichText.c:13683: error: expected `;' before ‘wxRichTextFormattingDialog’
RichText.c: In function ‘void XS_Wx__RichTextFormattingDialog_newFull(PerlInterpreter*, CV*)’:
RichText.c:13711: error: ‘wxRichTextFormattingDialog’ was not declared in this scope
RichText.c:13711: error: ‘RETVAL’ was not declared in this scope
RichText.c:13713: error: ‘wxWindow’ was not declared in this scope
RichText.c:13713: error: ‘parent’ was not declared in this scope
RichText.c:13713: error: expected primary-expression before ‘)’ token
RichText.c:13713: error: expected `;' before ‘wxPli_sv_2_object’
RichText.c:13714: error: ‘wxString’ was not declared in this scope
RichText.c:13714: error: expected `;' before ‘title’
RichText.c:13715: error: ‘wxWindowID’ was not declared in this scope
RichText.c:13715: error: expected `;' before ‘id’
RichText.c:13716: error: ‘wxPoint’ was not declared in this scope
RichText.c:13716: error: expected `;' before ‘pos’
RichText.c:13717: error: ‘wxSize’ was not declared in this scope
RichText.c:13717: error: expected `;' before ‘sz’
RichText.c:13721: error: ‘title’ was not declared in this scope
RichText.c:13721: error: ‘wxT’ was not declared in this scope
RichText.c:13723: error: ‘title’ was not declared in this scope
RichText.c:13723: error: ‘wxConvUTF8’ was not declared in this scope
RichText.c:13723: error: ‘wxConvLocal’ was not declared in this scope
RichText.c:13727: error: ‘id’ was not declared in this scope
RichText.c:13727: error: ‘wxID_ANY’ was not declared in this scope
RichText.c:13729: error: ‘id’ was not declared in this scope
RichText.c:13729: error: ‘wxPli_get_wxwindowid’ was not declared in this scope
RichText.c:13733: error: ‘pos’ was not declared in this scope
RichText.c:13733: error: ‘wxDefaultPosition’ was not declared in this scope
RichText.c:13735: error: ‘pos’ was not declared in this scope
RichText.c:13735: error: ‘wxPli_sv_2_wxpoint’ was not declared in this scope
RichText.c:13739: error: ‘sz’ was not declared in this scope
RichText.c:13739: error: ‘wxDefaultSize’ was not declared in this scope
RichText.c:13741: error: ‘sz’ was not declared in this scope
RichText.c:13741: error: ‘wxPli_sv_2_wxsize’ was not declared in this scope
RichText.c:13745: error: ‘wxDEFAULT_DIALOG_STYLE’ was not declared in this scope
RichText.c:13750: error: expected type-specifier before ‘wxRichTextFormattingDialog’
RichText.c:13750: error: expected `;' before ‘wxRichTextFormattingDialog’
RichText.c: In function ‘void XS_Wx__RichTextFormattingDialog_Create(PerlInterpreter*, CV*)’:
RichText.c:13801: error: ‘wxRichTextFormattingDialog’ was not declared in this scope
RichText.c:13801: error: ‘THIS’ was not declared in this scope
RichText.c:13801: error: expected primary-expression before ‘)’ token
RichText.c:13801: error: expected `;' before ‘wxPli_sv_2_object’
RichText.c:13804: error: ‘wxWindow’ was not declared in this scope
RichText.c:13804: error: ‘parent’ was not declared in this scope
RichText.c:13804: error: expected primary-expression before ‘)’ token
RichText.c:13804: error: expected `;' before ‘wxPli_sv_2_object’
RichText.c:13805: error: ‘wxString’ was not declared in this scope
RichText.c:13805: error: expected `;' before ‘title’
RichText.c:13806: error: ‘wxWindowID’ was not declared in this scope
RichText.c:13806: error: expected `;' before ‘id’
RichText.c:13807: error: ‘wxPoint’ was not declared in this scope
RichText.c:13807: error: expected `;' before ‘pos’
RichText.c:13808: error: ‘wxSize’ was not declared in this scope
RichText.c:13808: error: expected `;' before ‘sz’
RichText.c:13812: error: ‘title’ was not declared in this scope
RichText.c:13812: error: ‘wxT’ was not declared in this scope
RichText.c:13814: error: ‘title’ was not declared in this scope
RichText.c:13814: error: ‘wxConvUTF8’ was not declared in this scope
RichText.c:13814: error: ‘wxConvLocal’ was not declared in this scope
RichText.c:13818: error: ‘id’ was not declared in this scope
RichText.c:13818: error: ‘wxID_ANY’ was not declared in this scope
RichText.c:13820: error: ‘id’ was not declared in this scope
RichText.c:13820: error: ‘wxPli_get_wxwindowid’ was not declared in this scope
RichText.c:13824: error: ‘pos’ was not declared in this scope
RichText.c:13824: error: ‘wxDefaultPosition’ was not declared in this scope
RichText.c:13826: error: ‘pos’ was not declared in this scope
RichText.c:13826: error: ‘wxPli_sv_2_wxpoint’ was not declared in this scope
RichText.c:13830: error: ‘sz’ was not declared in this scope
RichText.c:13830: error: ‘wxDefaultSize’ was not declared in this scope
RichText.c:13832: error: ‘sz’ was not declared in this scope
RichText.c:13832: error: ‘wxPli_sv_2_wxsize’ was not declared in this scope
RichText.c:13836: error: ‘wxDEFAULT_DIALOG_STYLE’ was not declared in this scope
RichText.c:13841: error: ‘title’ was not declared in this scope
RichText.c:13841: error: ‘id’ was not declared in this scope
RichText.c:13841: error: ‘pos’ was not declared in this scope
RichText.c:13841: error: ‘sz’ was not declared in this scope
RichText.c: In function ‘void XS_Wx__RichTextFormattingDialog_GetStyle(PerlInterpreter*, CV*)’:
RichText.c:13867: error: ‘wxRichTextFormattingDialog’ was not declared in this scope
RichText.c:13867: error: ‘THIS’ was not declared in this scope
RichText.c:13867: error: expected primary-expression before ‘)’ token
RichText.c:13867: error: expected `;' before ‘wxPli_sv_2_object’
RichText.c:13869: error: ‘wxRichTextCtrl’ was not declared in this scope
RichText.c:13869: error: ‘ctrl’ was not declared in this scope
RichText.c:13869: error: expected primary-expression before ‘)’ token
RichText.c:13869: error: expected `;' before ‘wxPli_sv_2_object’
RichText.c:13870: error: ‘wxRichTextRange’ was not declared in this scope
RichText.c:13870: error: ‘range’ was not declared in this scope
RichText.c:13870: error: expected primary-expression before ‘)’ token
RichText.c:13870: error: expected `;' before ‘wxPli_sv_2_object’
RichText.c: In function ‘void XS_Wx__RichTextFormattingDialog_SetStyle(PerlInterpreter*, CV*)’:
RichText.c:13898: error: ‘wxRichTextFormattingDialog’ was not declared in this scope
RichText.c:13898: error: ‘THIS’ was not declared in this scope
RichText.c:13898: error: expected primary-expression before ‘)’ token
RichText.c:13898: error: expected `;' before ‘wxPli_sv_2_object’
RichText.c:13900: error: ‘wxTextAttrEx’ was not declared in this scope
RichText.c:13900: error: ‘style’ was not declared in this scope
RichText.c:13900: error: expected primary-expression before ‘)’ token
RichText.c:13900: error: expected `;' before ‘wxPli_sv_2_object’
RichText.c: In function ‘void XS_Wx__RichTextFormattingDialog_SetStyleDefinition(PerlInterpreter*, CV*)’:
RichText.c:13935: error: ‘wxRichTextFormattingDialog’ was not declared in this scope
RichText.c:13935: error: ‘THIS’ was not declared in this scope
RichText.c:13935: error: expected primary-expression before ‘)’ token
RichText.c:13935: error: expected `;' before ‘wxPli_sv_2_object’
RichText.c:13937: error: ‘wxRichTextStyleDefinition’ was not declared in this scope
RichText.c:13937: error: ‘styleDef’ was not declared in this scope
RichText.c:13937: error: expected primary-expression before ‘)’ token
RichText.c:13937: error: expected `;' before ‘wxPli_sv_2_object’
RichText.c:13938: error: ‘wxRichTextStyleSheet’ was not declared in this scope
RichText.c:13938: error: ‘sheet’ was not declared in this scope
RichText.c:13938: error: expected primary-expression before ‘)’ token
RichText.c:13938: error: expected `;' before ‘wxPli_sv_2_object’
RichText.c: In function ‘void XS_Wx__RichTextFormattingDialog_GetStyleDefinition(PerlInterpreter*, CV*)’:
RichText.c:13973: error: ‘wxRichTextFormattingDialog’ was not declared in this scope
RichText.c:13973: error: ‘THIS’ was not declared in this scope
RichText.c:13973: error: expected primary-expression before ‘)’ token
RichText.c:13973: error: expected `;' before ‘wxPli_sv_2_object’
RichText.c:13974: error: ‘wxRichTextStyleDefinition’ was not declared in this scope
RichText.c:13974: error: ‘RETVAL’ was not declared in this scope
RichText.c: In function ‘void XS_Wx__RichTextFormattingDialog_GetDialogStyleDefinition(PerlInterpreter*, CV*)’:
RichText.c:14005: error: ‘wxRichTextFormattingDialog’ was not declared in this scope
RichText.c:14005: error: ‘THIS’ was not declared in this scope
RichText.c:14005: error: expected primary-expression before ‘)’ token
RichText.c:14005: error: expected `;' before ‘wxPli_sv_2_object’
RichText.c:14006: error: ‘wxRichTextStyleDefinition’ was not declared in this scope
RichText.c:14006: error: ‘RETVAL’ was not declared in this scope
RichText.c:14007: error: ‘wxWindow’ was not declared in this scope
RichText.c:14007: error: ‘win’ was not declared in this scope
RichText.c:14007: error: expected primary-expression before ‘)’ token
RichText.c:14007: error: expected `;' before ‘wxPli_sv_2_object’
RichText.c: In function ‘void XS_Wx__RichTextFormattingDialog_GetStyleSheet(PerlInterpreter*, CV*)’:
RichText.c:14038: error: ‘wxRichTextFormattingDialog’ was not declared in this scope
RichText.c:14038: error: ‘THIS’ was not declared in this scope
RichText.c:14038: error: expected primary-expression before ‘)’ token
RichText.c:14038: error: expected `;' before ‘wxPli_sv_2_object’
RichText.c:14039: error: ‘wxRichTextStyleSheet’ was not declared in this scope
RichText.c:14039: error: ‘RETVAL’ was not declared in this scope
RichText.c: In function ‘void XS_Wx__RichTextFormattingDialog_UpdateDisplay(PerlInterpreter*, CV*)’:
RichText.c:14070: error: ‘wxRichTextFormattingDialog’ was not declared in this scope
RichText.c:14070: error: ‘THIS’ was not declared in this scope
RichText.c:14070: error: expected primary-expression before ‘)’ token
RichText.c:14070: error: expected `;' before ‘wxPli_sv_2_object’
RichText.c: In function ‘void XS_Wx__RichTextFormattingDialog_ApplyStyle(PerlInterpreter*, CV*)’:
RichText.c:14099: error: ‘wxRichTextFormattingDialog’ was not declared in this scope
RichText.c:14099: error: ‘THIS’ was not declared in this scope
RichText.c:14099: error: expected primary-expression before ‘)’ token
RichText.c:14099: error: expected `;' before ‘wxPli_sv_2_object’
RichText.c:14101: error: ‘wxRichTextCtrl’ was not declared in this scope
RichText.c:14101: error: ‘ctrl’ was not declared in this scope
RichText.c:14101: error: expected primary-expression before ‘)’ token
RichText.c:14101: error: expected `;' before ‘wxPli_sv_2_object’
RichText.c:14102: error: ‘wxRichTextRange’ was not declared in this scope
RichText.c:14102: error: ‘range’ was not declared in this scope
RichText.c:14102: error: expected primary-expression before ‘)’ token
RichText.c:14102: error: expected `;' before ‘wxPli_sv_2_object’
RichText.c:14106: error: ‘wxRICHTEXT_SETSTYLE_WITH_UNDO’ was not declared in this scope
RichText.c:14106: error: ‘wxRICHTEXT_SETSTYLE_OPTIMIZE’ was not declared in this scope
RichText.c: In function ‘void XS_Wx__RichTextFormattingDialog_GetAttributes(PerlInterpreter*, CV*)’:
RichText.c:14137: error: ‘wxRichTextFormattingDialog’ was not declared in this scope
RichText.c:14137: error: ‘THIS’ was not declared in this scope
RichText.c:14137: error: expected primary-expression before ‘)’ token
RichText.c:14137: error: expected `;' before ‘wxPli_sv_2_object’
RichText.c:14138: error: ‘wxTextAttrEx’ was not declared in this scope
RichText.c:14138: error: ‘RETVAL’ was not declared in this scope
RichText.c:14140: error: expected type-specifier before ‘wxTextAttrEx’
RichText.c:14140: error: expected `;' before ‘wxTextAttrEx’
RichText.c: In function ‘void XS_Wx__RichTextFormattingDialog_SetAttributes(PerlInterpreter*, CV*)’:
RichText.c:14168: error: ‘wxRichTextFormattingDialog’ was not declared in this scope
RichText.c:14168: error: ‘THIS’ was not declared in this scope
RichText.c:14168: error: expected primary-expression before ‘)’ token
RichText.c:14168: error: expected `;' before ‘wxPli_sv_2_object’
RichText.c:14169: error: ‘wxTextAttrEx’ was not declared in this scope
RichText.c:14169: error: ‘attr’ was not declared in this scope
RichText.c:14169: error: expected primary-expression before ‘)’ token
RichText.c:14169: error: expected `;' before ‘wxPli_sv_2_object’
RichText.c: In function ‘void XS_Wx__RichTextFormattingDialog_SetImageList(PerlInterpreter*, CV*)’:
RichText.c:14195: error: ‘wxRichTextFormattingDialog’ was not declared in this scope
RichText.c:14195: error: ‘THIS’ was not declared in this scope
RichText.c:14195: error: expected primary-expression before ‘)’ token
RichText.c:14195: error: expected `;' before ‘wxPli_sv_2_object’
RichText.c:14196: error: ‘wxImageList’ was not declared in this scope
RichText.c:14196: error: ‘imageList’ was not declared in this scope
RichText.c:14196: error: expected primary-expression before ‘)’ token
RichText.c:14196: error: expected `;' before ‘wxPli_sv_2_object’
RichText.c: In function ‘void XS_Wx__RichTextFormattingDialog_GetImageList(PerlInterpreter*, CV*)’:
RichText.c:14222: error: ‘wxRichTextFormattingDialog’ was not declared in this scope
RichText.c:14222: error: ‘THIS’ was not declared in this scope
RichText.c:14222: error: expected primary-expression before ‘)’ token
RichText.c:14222: error: expected `;' before ‘wxPli_sv_2_object’
RichText.c:14223: error: ‘wxImageList’ was not declared in this scope
RichText.c:14223: error: ‘RETVAL’ was not declared in this scope
RichText.c: In function ‘void XS_Wx__RichTextFormattingDialog_ShowToolTips(PerlInterpreter*, CV*)’:
RichText.c:14254: error: ‘wxRichTextFormattingDialog’ has not been declared
RichText.c: In function ‘void XS_Wx__RichTextFormattingDialog_SetShowToolTips(PerlInterpreter*, CV*)’:
RichText.c:14274: error: ‘wxRichTextFormattingDialog’ has not been declared
RichText.c: In function ‘void XS_Wx__RichTextFormattingDialog_AddPageId(PerlInterpreter*, CV*)’:
RichText.c:14291: error: ‘wxRichTextFormattingDialog’ was not declared in this scope
RichText.c:14291: error: ‘THIS’ was not declared in this scope
RichText.c:14291: error: expected primary-expression before ‘)’ token
RichText.c:14291: error: expected `;' before ‘wxPli_sv_2_object’
In file included from cpp/filehandler.h:8,
                 from RichText.c:14317:
../../cpp/streams.h: At global scope:
../../cpp/streams.h:23: error: expected class-name before ‘{’ token
../../cpp/streams.h:33: error: ‘wxFileOffset’ does not name a type
../../cpp/streams.h:42: error: ‘wxSeekMode’ has not been declared
../../cpp/streams.h:50: error: expected class-name before ‘{’ token
../../cpp/streams.h:59: error: ‘wxFileOffset’ does not name a type
../../cpp/streams.h:68: error: ‘wxSeekMode’ has not been declared
In file included from RichText.c:14317:
cpp/filehandler.h:43: error: expected class-name before ‘{’ token
cpp/filehandler.h:47: error: expected ‘,’ or ‘...’ before ‘&’ token
cpp/filehandler.h:49: error: ISO C++ forbids declaration of ‘wxString’ with no type
cpp/filehandler.h:56: error: expected ‘,’ or ‘...’ before ‘&’ token
cpp/filehandler.h:56: error: ISO C++ forbids declaration of ‘wxString’ with no type
cpp/filehandler.h:63: error: expected ‘,’ or ‘...’ before ‘&’ token
cpp/filehandler.h:63: error: ISO C++ forbids declaration of ‘wxString’ with no type
cpp/filehandler.h:67: error: ‘wxRichTextBuffer’ has not been declared
cpp/filehandler.h:67: error: ‘wxInputStream’ is not a type
cpp/filehandler.h:68: error: ‘wxRichTextBuffer’ has not been declared
cpp/filehandler.h:68: error: ‘wxOutputStream’ is not a type
cpp/filehandler.h: In constructor ‘wxPlRichTextFileHandler::wxPlRichTextFileHandler(const char*, int)’:
cpp/filehandler.h:50: error: class ‘wxPlRichTextFileHandler’ does not have any field named ‘wxRichTextFileHandler’
cpp/filehandler.h:50: error: ‘name’ was not declared in this scope
cpp/filehandler.h:50: error: ‘ext’ was not declared in this scope
cpp/filehandler.h:50: error: ‘type’ was not declared in this scope
cpp/filehandler.h: In member function ‘bool wxPlRichTextFileHandler::base_CanHandle(int)’:
cpp/filehandler.h:57: error: ‘wxRichTextFileHandler’ has not been declared
cpp/filehandler.h:57: error: ‘filename’ was not declared in this scope
cpp/filehandler.h: In member function ‘bool wxPlRichTextFileHandler::base_CanLoad()’:
cpp/filehandler.h:59: error: ‘wxRichTextFileHandler’ has not been declared
cpp/filehandler.h: In member function ‘bool wxPlRichTextFileHandler::base_CanSave()’:
cpp/filehandler.h:61: error: ‘wxRichTextFileHandler’ has not been declared
cpp/filehandler.h: At global scope:
cpp/filehandler.h:71: error: expected ‘,’ or ‘...’ before ‘&’ token
cpp/filehandler.h:71: error: ISO C++ forbids declaration of ‘wxString’ with no type
cpp/filehandler.h: In member function ‘bool wxPlRichTextFileHandler::CanHandle(int)’:
cpp/filehandler.h:71: error: ‘p1’ was not declared in this scope
cpp/filehandler.h:71: error: ‘wxRichTextFileHandler’ has not been declared
cpp/filehandler.h:71: error: ‘p1’ was not declared in this scope
cpp/filehandler.h: In member function ‘bool wxPlRichTextFileHandler::CanLoad()’:
cpp/filehandler.h:73: error: ‘wxRichTextFileHandler’ has not been declared
cpp/filehandler.h: In member function ‘bool wxPlRichTextFileHandler::CanSave()’:
cpp/filehandler.h:75: error: ‘wxRichTextFileHandler’ has not been declared
cpp/filehandler.h: At global scope:
cpp/filehandler.h:77: error: ‘bool wxPlRichTextFileHandler::DoLoadFile’ is not a static member of ‘class wxPlRichTextFileHandler’
cpp/filehandler.h:77: error: ‘wxRichTextBuffer’ was not declared in this scope
cpp/filehandler.h:77: error: ‘p1’ was not declared in this scope
cpp/filehandler.h:77: error: ‘p2’ was not declared in this scope
cpp/filehandler.h:77: error: initializer expression list treated as compound expression
cpp/filehandler.h:77: error: expected ‘,’ or ‘;’ before ‘{’ token
make[2]: *** [RichText.o] Error 1
make[1]: *** [subdirs] Error 2
make: *** [subdirs] Error 2

[MSG] [Sun Aug 15 05:22:19 2010] Sending test report for 'Wx-0.9702'
[MSG] [Sun Aug 15 05:22:20 2010] Ok, not sending test report
[ERROR] [Sun Aug 15 05:22:20 2010] Unable to create a new distribution object for 'Wx' -- cannot continue
[ERROR] [Sun Aug 15 05:22:20 2010] Failed to install 'Wx' as prerequisite for 'Padre::PluginBuilder'
[ERROR] [Sun Aug 15 05:22:20 2010] Unable to satisfy prerequisites for 'Padre::PluginBuilder' -- aborting install
[ERROR] [Sun Aug 15 05:22:20 2010] Unable to create a new distribution object for 'Padre::PluginBuilder' -- cannot continue
[ERROR] [Sun Aug 15 05:22:20 2010] Failed to install 'Padre::PluginBuilder' as prerequisite for 'Padre::Plugin::PAR'
[ERROR] [Sun Aug 15 05:22:20 2010] Unable to satisfy 'configure_requires' for 'Padre::Plugin::PAR' -- aborting install


Perl module toolchain versions installed:
	Module Name                        Have
	CPANPLUS                         0.9007
	CPANPLUS::Dist::Build              0.46
	Cwd                                3.31
	ExtUtils::CBuilder               0.2703
	ExtUtils::Command                  1.16
	ExtUtils::Install                  1.55
	ExtUtils::MakeMaker              6.5601
	ExtUtils::Manifest                 1.58
	ExtUtils::ParseXS                2.2206
	File::Spec                         3.31
	Module::Build                    0.3607
	Test::Harness                      3.21
	Test::More                         0.94
	version                            0.82

******************************** NOTE ********************************
The comments above are created mechanically, possibly without manual
checking by the sender.  As there are many people performing automatic
tests on each upload to CPAN, it is likely that you will receive 
identical messages about the same problem.

If you believe that the message is mistaken, please reply to the first
one with correction and/or additional informations, and do not take
it personally.  We appreciate your patience. :)
**********************************************************************

Additional comments:
 

This report was machine-generated by CPANPLUS::Dist::YACSmoke 0.58.
Powered by minismokebox version 0.26

------------------------------
ENVIRONMENT AND OTHER CONTEXT
------------------------------

Environment variables:

    AUTOMATED_TESTING = 1
    LANG = en_GB.UTF-8
    PATH = /usr/local/bin:/usr/bin:/bin:/usr/games
    PERL5LIB = :/home/cpan/pit/rel/conf/perl-5.13.0/.cpanplus/5.13.0/build/Alien-wxWidgets-0.51/blib/lib:/home/cpan/pit/rel/conf/perl-5.13.0/.cpanplus/5.13.0/build/Alien-wxWidgets-0.51/blib/arch:/home/cpan/pit/rel/conf/perl-5.13.0/.cpanplus/5.13.0/build/File-Next-1.06/blib/lib:/home/cpan/pit/rel/conf/perl-5.13.0/.cpanplus/5.13.0/build/File-Next-1.06/blib/arch:/home/cpan/pit/rel/conf/perl-5.13.0/.cpanplus/5.13.0/build/ack-1.92/blib/lib:/home/cpan/pit/rel/conf/perl-5.13.0/.cpanplus/5.13.0/build/ack-1.92/blib/arch:/home/cpan/pit/rel/conf/perl-5.13.0/.cpanplus/5.13.0/build/HTML-Tagset-3.20/blib/lib:/home/cpan/pit/rel/conf/perl-5.13.0/.cpanplus/5.13.0/build/HTML-Tagset-3.20/blib/arch:/home/cpan/pit/rel/conf/perl-5.13.0/.cpanplus/5.13.0/build/HTML-Parser-3.66/blib/lib:/home/cpan/pit/rel/conf/perl-5.13.0/.cpanplus/5.13.0/build/HTML-Parser-3.66/blib/arch:/home/cpan/pit/rel/conf/perl-5.13.0/.cpanplus/5.13.0/build/URI-1.54/blib/lib:/home/cpan/pit/rel/conf/perl-5.13.0/.cpanplus/5.13.0/build/URI-1.54/blib/arch:/home/cpan/pit/rel/conf/perl-5.13.0/.cpanplus/5.13.0/build/libwww-perl-5.836/blib/lib:/home/cpan/pit/rel/conf/perl-5.13.0/.cpanplus/5.13.0/build/libwww-perl-5.836/blib/arch:/home/cpan/pit/rel/conf/perl-5.13.0/.cpanplus/5.13.0/build/App-cpanminus-1.0010/blib/lib:/home/cpan/pit/rel/conf/perl-5.13.0/.cpanplus/5.13.0/build/App-cpanminus-1.0010/blib/arch:/home/cpan/pit/rel/conf/perl-5.13.0/.cpanplus/5.13.0/build/Capture-Tiny-0.08/blib/lib:/home/cpan/pit/rel/conf/perl-5.13.0/.cpanplus/5.13.0/build/Capture-Tiny-0.08/blib/arch:/home/cpan/pit/rel/conf/perl-5.13.0/.cpanplus/5.13.0/build/Class-Adapter-1.07/blib/lib:/home/cpan/pit/rel/conf/perl-5.13.0/.cpanplus/5.13.0/build/Class-Adapter-1.07/blib/arch:/home/cpan/pit/rel/conf/perl-5.13.0/.cpanplus/5.13.0/build/Class-Inspector-1.24/blib/lib:/home/cpan/pit/rel/conf/perl-5.13.0/.cpanplus/5.13.0/build/Class-Inspector-1.24/blib/arch:/home/cpan/pit/rel/conf/perl-5.13.0/.cpanplus/5.13.0/build/Class-Unload-0.06/blib/lib:/home/cpan/pit/rel/conf/perl-5.13.0/.cpanplus/5.13.0/build/Class-Unload-0.06/blib/arch:/home/cpan/pit/rel/conf/perl-5.13.0/.cpanplus/5.13.0/build/Class-XSAccessor-1.06/blib/lib:/home/cpan/pit/rel/conf/perl-5.13.0/.cpanplus/5.13.0/build/Class-XSAccessor-1.06/blib/arch:/home/cpan/pit/rel/conf/perl-5.13.0/.cpanplus/5.13.0/build/DBI-1.613/blib/lib:/home/cpan/pit/rel/conf/perl-5.13.0/.cpanplus/5.13.0/build/DBI-1.613/blib/arch:/home/cpan/pit/rel/conf/perl-5.13.0/.cpanplus/5.13.0/build/DBD-SQLite-1.29/blib/lib:/home/cpan/pit/rel/conf/perl-5.13.0/.cpanplus/5.13.0/build/DBD-SQLite-1.29/blib/arch:/home/cpan/pit/rel/conf/perl-5.13.0/.cpanplus/5.13.0/build/Test-Tester-0.107/blib/lib:/home/cpan/pit/rel/conf/perl-5.13.0/.cpanplus/5.13.0/build/Test-Tester-0.107/blib/arch:/home/cpan/pit/rel/conf/perl-5.13.0/.cpanplus/5.13.0/build/Test-NoWarnings-1.01/blib/lib:/home/cpan/pit/rel/conf/perl-5.13.0/.cpanplus/5.13.0/build/Test-NoWarnings-1.01/blib/arch:/home/cpan/pit/rel/conf/perl-5.13.0/.cpanplus/5.13.0/build/Test-Deep-0.106/blib/lib:/home/cpan/pit/rel/conf/perl-5.13.0/.cpanplus/5.13.0/build/Test-Deep-0.106/blib/arch:/home/cpan/pit/rel/conf/perl-5.13.0/.cpanplus/5.13.0/build/Debug-Client-0.11/blib/lib:/home/cpan/pit/rel/conf/perl-5.13.0/.cpanplus/5.13.0/build/Debug-Client-0.11/blib/arch:/home/cpan/pit/rel/conf/perl-5.13.0/.cpanplus/5.13.0/build/Devel-Dumpvar-1.06/blib/lib:/home/cpan/pit/rel/conf/perl-5.13.0/.cpanplus/5.13.0/build/Devel-Dumpvar-1.06/blib/arch:/home/cpan/pit/rel/conf/perl-5.13.0/.cpanplus/5.13.0/build/Devel-Refactor-0.05/blib/lib:/home/cpan/pit/rel/conf/perl-5.13.0/.cpanplus/5.13.0/build/Devel-Refactor-0.05/blib/arch:/home/cpan/pit/rel/conf/perl-5.13.0/.cpanplus/5.13.0/build/File-Copy-Recursive-0.38/blib/lib:/home/cpan/pit/rel/conf/perl-5.13.0/.cpanplus/5.13.0/build/File-Copy-Recursive-0.38/blib/arch:/home/cpan/pit/rel/conf/perl-5.13.0/.cpanplus/5.13.0/build/Number-Compare-0.01/blib/lib:/home/cpan/pit/rel/conf/perl-5.13.0/.cpanplus/5.13.0/build/Number-Compare-0.01/blib/arch:/home/cpan/pit/rel/conf/perl-5.13.0/.cpanplus/5.13.0/build/Text-Glob-0.08/blib/lib:/home/cpan/pit/rel/conf/perl-5.13.0/.cpanplus/5.13.0/build/Text-Glob-0.08/blib/arch:/home/cpan/pit/rel/conf/perl-5.13.0/.cpanplus/5.13.0/build/File-Find-Rule-0.32/blib/lib:/home/cpan/pit/rel/conf/perl-5.13.0/.cpanplus/5.13.0/build/File-Find-Rule-0.32/blib/arch:/home/cpan/pit/rel/conf/perl-5.13.0/.cpanplus/5.13.0/build/IPC-Run3-0.043/blib/lib:/home/cpan/pit/rel/conf/perl-5.13.0/.cpanplus/5.13.0/build/IPC-Run3-0.043/blib/arch:/home/cpan/pit/rel/conf/perl-5.13.0/.cpanplus/5.13.0/build/Probe-Perl-0.01/blib/lib:/home/cpan/pit/rel/conf/perl-5.13.0/.cpanplus/5.13.0/build/Probe-Perl-0.01/blib/arch:/home/cpan/pit/rel/conf/perl-5.13.0/.cpanplus/5.13.0/build/Test-Script-1.07/blib/lib:/home/cpan/pit/rel/conf/perl-5.13.0/.cpanplus/5.13.0/build/Test-Script-1.07/blib/arch:/home/cpan/pit/rel/conf/perl-5.13.0/.cpanplus/5.13.0/build/File-Which-1.09/blib/lib:/home/cpan/pit/rel/conf/perl-5.13.0/.cpanplus/5.13.0/build/File-Which-1.09/blib/arch:/home/cpan/pit/rel/conf/perl-5.13.0/.cpanplus/5.13.0/build/File-HomeDir-0.91/blib/lib:/home/cpan/pit/rel/conf/perl-5.13.0/.cpanplus/5.13.0/build/File-HomeDir-0.91/blib/arch:/home/cpan/pit/rel/conf/perl-5.13.0/.cpanplus/5.13.0/build/File-Remove-1.42/blib/lib:/home/cpan/pit/rel/conf/perl-5.13.0/.cpanplus/5.13.0/build/File-Remove-1.42/blib/arch:/home/cpan/pit/rel/conf/perl-5.13.0/.cpanplus/5.13.0/build/File-ShareDir-1.02/blib/lib:/home/cpan/pit/rel/conf/perl-5.13.0/.cpanplus/5.13.0/build/File-ShareDir-1.02/blib/arch:/home/cpan/pit/rel/conf/perl-5.13.0/.cpanplus/5.13.0/build/File-pushd-1.00/blib/lib:/home/cpan/pit/rel/conf/perl-5.13.0/.cpanplus/5.13.0/build/File-pushd-1.00/blib/arch:/home/cpan/pit/rel/conf/perl-5.13.0/.cpanplus/5.13.0/build/JSON-2.21/blib/lib:/home/cpan/pit/rel/conf/perl-5.13.0/.cpanplus/5.13.0/build/JSON-2.21/blib/arch:/home/cpan/pit/rel/conf/perl-5.13.0/.cpanplus/5.13.0/build/Module-ScanDeps-0.98/blib/lib:/home/cpan/pit/rel/conf/perl-5.13.0/.cpanplus/5.13.0/build/Module-ScanDeps-0.98/blib/arch:/home/cpan/pit/rel/conf/perl-5.13.0/.cpanplus/5.13.0/build/PAR-Dist-0.47/blib/lib:/home/cpan/pit/rel/conf/perl-5.13.0/.cpanplus/5.13.0/build/PAR-Dist-0.47/blib/arch:/home/cpan/pit/rel/conf/perl-5.13.0/.cpanplus/5.13.0/build/YAML-0.71/blib/lib:/home/cpan/pit/rel/conf/perl-5.13.0/.cpanplus/5.13.0/build/YAML-0.71/blib/arch:/home/cpan/pit/rel/conf/perl-5.13.0/.cpanplus/5.13.0/build/Error-0.17016/blib/lib:/home/cpan/pit/rel/conf/perl-5.13.0/.cpanplus/5.13.0/build/Error-0.17016/blib/arch:/home/cpan/pit/rel/conf/perl-5.13.0/.cpanplus/5.13.0/build/YAML-Perl-0.02/blib/lib:/home/cpan/pit/rel/conf/perl-5.13.0/.cpanplus/5.13.0/build/YAML-Perl-0.02/blib/arch:/home/cpan/pit/rel/conf/perl-5.13.0/.cpanplus/5.13.0/build/Devel-Leak-0.03/blib/lib:/home/cpan/pit/rel/conf/perl-5.13.0/.cpanplus/5.13.0/build/Devel-Leak-0.03/blib/arch:/home/cpan/pit/rel/conf/perl-5.13.0/.cpanplus/5.13.0/build/YAML-Syck-1.12/blib/lib:/home/cpan/pit/rel/conf/perl-5.13.0/.cpanplus/5.13.0/build/YAML-Syck-1.12/blib/arch:/home/cpan/pit/rel/conf/perl-5.13.0/.cpanplus/5.13.0/build/YAML-LibYAML-0.33/blib/lib:/home/cpan/pit/rel/conf/perl-5.13.0/.cpanplus/5.13.0/build/YAML-LibYAML-0.33/blib/arch:/home/cpan/pit/rel/conf/perl-5.13.0/.cpanplus/5.13.0/build/YAML-Tiny-1.44/blib/lib:/home/cpan/pit/rel/conf/perl-5.13.0/.cpanplus/5.13.0/build/YAML-Tiny-1.44/blib/arch:/home/cpan/pit/rel/conf/perl-5.13.0/.cpanplus/5.13.0/build/Module-Install-1.00/blib/lib:/home/cpan/pit/rel/conf/perl-5.13.0/.cpanplus/5.13.0/build/Module-Install-1.00/blib/arch:/home/cpan/pit/rel/conf/perl-5.13.0/.cpanplus/5.13.0/build/Format-Human-Bytes-0.05/blib/lib:/home/cpan/pit/rel/conf/perl-5.13.0/.cpanplus/5.13.0/build/Format-Human-Bytes-0.05/blib/arch:/home/cpan/pit/rel/conf/perl-5.13.0/.cpanplus/5.13.0/build/IO-stringy-2.110/blib/lib:/home/cpan/pit/rel/conf/perl-5.13.0/.cpanplus/5.13.0/build/IO-stringy-2.110/blib/arch:/home/cpan/pit/rel/conf/perl-5.13.0/.cpanplus/5.13.0/build/IO-String-1.08/blib/lib:/home/cpan/pit/rel/conf/perl-5.13.0/.cpanplus/5.13.0/build/IO-String-1.08/blib/arch:/home/cpan/pit/rel/conf/perl-5.13.0/.cpanplus/5.13.0/build/List-MoreUtils-0.22/blib/lib:/home/cpan/pit/rel/conf/perl-5.13.0/.cpanplus/5.13.0/build/List-MoreUtils-0.22/blib/arch:/home/cpan/pit/rel/conf/perl-5.13.0/.cpanplus/5.13.0/build/Locale-Maketext-Gettext-1.28/blib/lib:/home/cpan/pit/rel/conf/perl-5.13.0/.cpanplus/5.13.0/build/Locale-Maketext-Gettext-1.28/blib/arch:/home/cpan/pit/rel/conf/perl-5.13.0/.cpanplus/5.13.0/build/Locale-Msgfmt-0.14/blib/lib:/home/cpan/pit/rel/conf/perl-5.13.0/.cpanplus/5.13.0/build/Locale-Msgfmt-0.14/blib/arch:/home/cpan/pit/rel/conf/perl-5.13.0/.cpanplus/5.13.0/build/Params-Util-1.01/blib/lib:/home/cpan/pit/rel/conf/perl-5.13.0/.cpanplus/5.13.0/build/Params-Util-1.01/blib/arch:/home/cpan/pit/rel/conf/perl-5.13.0/.cpanplus/5.13.0/build/Sub-Uplevel-0.22/blib/lib:/home/cpan/pit/rel/conf/perl-5.13.0/.cpanplus/5.13.0/build/Sub-Uplevel-0.22/blib/arch:/home/cpan/pit/rel/conf/perl-5.13.0/.cpanplus/5.13.0/build/Test-Exception-0.29/blib/lib:/home/cpan/pit/rel/conf/perl-5.13.0/.cpanplus/5.13.0/build/Test-Exception-0.29/blib/arch:/home/cpan/pit/rel/conf/perl-5.13.0/.cpanplus/5.13.0/build/Tree-DAG_Node-1.06/blib/lib:/home/cpan/pit/rel/conf/perl-5.13.0/.cpanplus/5.13.0/build/Tree-DAG_Node-1.06/blib/arch:/home/cpan/pit/rel/conf/perl-5.13.0/.cpanplus/5.13.0/build/Test-Warn-0.21/blib/lib:/home/cpan/pit/rel/conf/perl-5.13.0/.cpanplus/5.13.0/build/Test-Warn-0.21/blib/arch:/home/cpan/pit/rel/conf/perl-5.13.0/.cpanplus/5.13.0/build/Module-Manifest-1.08/blib/lib:/home/cpan/pit/rel/conf/perl-5.13.0/.cpanplus/5.13.0/build/Module-Manifest-1.08/blib/arch:/home/cpan/pit/rel/conf/perl-5.13.0/.cpanplus/5.13.0/build/Module-Refresh-0.13/blib/lib:/home/cpan/pit/rel/conf/perl-5.13.0/.cpanplus/5.13.0/build/Module-Refresh-0.13/blib/arch:/home/cpan/pit/rel/conf/perl-5.13.0/.cpanplus/5.13.0/build/Module-Starter-1.54/blib/lib:/home/cpan/pit/rel/conf/perl-5.13.0/.cpanplus/5.13.0/build/Module-Starter-1.54/blib/arch:/home/cpan/pit/rel/conf/perl-5.13.0/.cpanplus/5.13.0/build/ORLite-1.45/blib/lib:/home/cpan/pit/rel/conf/perl-5.13.0/.cpanplus/5.13.0/build/ORLite-1.45/blib/arch:/home/cpan/pit/rel/conf/perl-5.13.0/.cpanplus/5.13.0/build/POD2-Base-0.043/blib/lib:/home/cpan/pit/rel/conf/perl-5.13.0/.cpanplus/5.13.0/build/POD2-Base-0.043/blib/arch:/home/cpan/pit/rel/conf/perl-5.13.0/.cpanplus/5.13.0/build/Clone-0.31/blib/lib:/home/cpan/pit/rel/conf/perl-5.13.0/.cpanplus/5.13.0/build/Clone-0.31/blib/arch:/home/cpan/pit/rel/conf/perl-5.13.0/.cpanplus/5.13.0/build/Task-Weaken-1.03/blib/lib:/home/cpan/pit/rel/conf/perl-5.13.0/.cpanplus/5.13.0/build/Task-Weaken-1.03/blib/arch:/home/cpan/pit/rel/conf/perl-5.13.0/.cpanplus/5.13.0/build/Test-Object-0.07/blib/lib:/home/cpan/pit/rel/conf/perl-5.13.0/.cpanplus/5.13.0/build/Test-Object-0.07/blib/arch:/home/cpan/pit/rel/conf/perl-5.13.0/.cpanplus/5.13.0/build/Hook-LexWrap-0.23/blib/lib:/home/cpan/pit/rel/conf/perl-5.13.0/.cpanplus/5.13.0/build/Hook-LexWrap-0.23/blib/arch:/home/cpan/pit/rel/conf/perl-5.13.0/.cpanplus/5.13.0/build/Test-SubCalls-1.09/blib/lib:/home/cpan/pit/rel/conf/perl-5.13.0/.cpanplus/5.13.0/build/Test-SubCalls-1.09/blib/arch:/home/cpan/pit/rel/conf/perl-5.13.0/.cpanplus/5.13.0/build/PPI-1.213/blib/lib:/home/cpan/pit/rel/conf/perl-5.13.0/.cpanplus/5.13.0/build/PPI-1.213/blib/arch:/home/cpan/pit/rel/conf/perl-5.13.0/.cpanplus/5.13.0/build/Algorithm-Diff-1.1902/blib/lib:/home/cpan/pit/rel/conf/perl-5.13.0/.cpanplus/5.13.0/build/Algorithm-Diff-1.1902/blib/arch:/home/cpan/pit/rel/conf/perl-5.13.0/.cpanplus/5.13.0/build/Text-Diff-1.37/blib/lib:/home/cpan/pit/rel/conf/perl-5.13.0/.cpanplus/5.13.0/build/Text-Diff-1.37/blib/arch:/home/cpan/pit/rel/conf/perl-5.13.0/.cpanplus/5.13.0/build/Test-Differences-0.500/blib/lib:/home/cpan/pit/rel/conf/perl-5.13.0/.cpanplus/5.13.0/build/Test-Differences-0.500/blib/arch:/home/cpan/pit/rel/conf/perl-5.13.0/.cpanplus/5.13.0/build/PPIx-EditorTools-0.09/blib/lib:/home/cpan/pit/rel/conf/perl-5.13.0/.cpanplus/5.13.0/build/PPIx-EditorTools-0.09/blib/arch:/home/cpan/pit/rel/conf/perl-5.13.0/.cpanplus/5.13.0/build/Readonly-1.03/blib/lib:/home/cpan/pit/rel/conf/perl-5.13.0/.cpanplus/5.13.0/build/Readonly-1.03/blib/arch:/home/cpan/pit/rel/conf/perl-5.13.0/.cpanplus/5.13.0/build/PPIx-Regexp-0.010/blib/lib:/home/cpan/pit/rel/conf/perl-5.13.0/.cpanplus/5.13.0/build/PPIx-Regexp-0.010/blib/arch:/home/cpan/pit/rel/conf/perl-5.13.0/.cpanplus/5.13.0/build/File-Slurp-9999.13/blib/lib:/home/cpan/pit/rel/conf/perl-5.13.0/.cpanplus/5.13.0/build/File-Slurp-9999.13/blib/arch:/home/cpan/pit/rel/conf/perl-5.13.0/.cpanplus/5.13.0/build/Pod-POM-0.27/blib/lib:/home/cpan/pit/rel/conf/perl-5.13.0/.cpanplus/5.13.0/build/Pod-POM-0.27/blib/arch:/home/cpan/pit/rel/conf/perl-5.13.0/.cpanplus/5.13.0/build/Parse-ErrorString-Perl-0.13/blib/lib:/home/cpan/pit/rel/conf/perl-5.13.0/.cpanplus/5.13.0/build/Parse-ErrorString-Perl-0.13/blib/arch:/home/cpan/pit/rel/conf/perl-5.13.0/.cpanplus/5.13.0/build/Parse-ExuberantCTags-1.01/blib/lib:/home/cpan/pit/rel/conf/perl-5.13.0/.cpanplus/5.13.0/build/Parse-ExuberantCTags-1.01/blib/arch:/home/cpan/pit/rel/conf/perl-5.13.0/.cpanplus/5.13.0/build/Pod-Abstract-0.20/blib/lib:/home/cpan/pit/rel/conf/perl-5.13.0/.cpanplus/5.13.0/build/Pod-Abstract-0.20/blib/arch:/home/cpan/pit/rel/conf/perl-5.13.0/.cpanplus/5.13.0/build/Readonly-XS-1.05/blib/lib:/home/cpan/pit/rel/conf/perl-5.13.0/.cpanplus/5.13.0/build/Readonly-XS-1.05/blib/arch:/home/cpan/pit/rel/conf/perl-5.13.0/.cpanplus/5.13.0/build/Template-Tiny-0.11/blib/lib:/home/cpan/pit/rel/conf/perl-5.13.0/.cpanplus/5.13.0/build/Template-Tiny-0.11/blib/arch:/home/cpan/pit/rel/conf/perl-5.13.0/.cpanplus/5.13.0/build/Scalar-List-Utils-1.23/blib/lib:/home/cpan/pit/rel/conf/perl-5.13.0/.cpanplus/5.13.0/build/Scalar-List-Utils-1.23/blib/arch:/home/cpan/pit/rel/conf/perl-5.13.0/.cpanplus/5.13.0/build/UNIVERSAL-can-1.16/blib/lib:/home/cpan/pit/rel/conf/perl-5.13.0/.cpanplus/5.13.0/build/UNIVERSAL-can-1.16/blib/arch:/home/cpan/pit/rel/conf/perl-5.13.0/.cpanplus/5.13.0/build/UNIVERSAL-isa-1.03/blib/lib:/home/cpan/pit/rel/conf/perl-5.13.0/.cpanplus/5.13.0/build/UNIVERSAL-isa-1.03/blib/arch:/home/cpan/pit/rel/conf/perl-5.13.0/.cpanplus/5.13.0/build/Test-MockObject-1.09/blib/lib:/home/cpan/pit/rel/conf/perl-5.13.0/.cpanplus/5.13.0/build/Test-MockObject-1.09/blib/arch:/home/cpan/pit/rel/conf/perl-5.13.0/.cpanplus/5.13.0/build/Text-FindIndent-0.08/blib/lib:/home/cpan/pit/rel/conf/perl-5.13.0/.cpanplus/5.13.0/build/Text-FindIndent-0.08/blib/arch:/home/cpan/pit/rel/conf/perl-5.13.0/.cpanplus/5.13.0/build/Spiffy-0.30/blib/lib:/home/cpan/pit/rel/conf/perl-5.13.0/.cpanplus/5.13.0/build/Spiffy-0.30/blib/arch:/home/cpan/pit/rel/conf/perl-5.13.0/.cpanplus/5.13.0/build/Test-Base-0.59/blib/lib:/home/cpan/pit/rel/conf/perl-5.13.0/.cpanplus/5.13.0/build/Test-Base-0.59/blib/arch:/home/cpan/pit/rel/conf/perl-5.13.0/.cpanplus/5.13.0/build/ExtUtils-XSpp-0.15/blib/lib:/home/cpan/pit/rel/conf/perl-5.13.0/.cpanplus/5.13.0/build/ExtUtils-XSpp-0.15/blib/arch
    PERL5_CPANPLUS_IS_RUNNING = 23153
    PERL5_CPANPLUS_IS_VERSION = 0.9007
    PERL5_MINISMOKEBOX = 0.26
    PERL5_YACSMOKE_BASE = /home/cpan/pit/rel/conf/perl-5.13.0
    PERL_EXTUTILS_AUTOINSTALL = --defaultdeps
    PERL_MM_USE_DEFAULT = 1
    SHELL = /bin/bash
    TERM = screen.linux

Perl special variables (and OS-specific diagnostics, for MSWin32):

    Perl: $^X = /home/cpan/pit/rel/perl-5.13.0/bin/perl5.13.0
    UID:  $<  = 1001
    EUID: $>  = 1001
    GID:  $(  = 1001 1001
    EGID: $)  = 1001 1001


-------------------------------


--

Summary of my perl5 (revision 5 version 13 subversion 0) configuration:
   
  Platform:
    osname=linux, osvers=2.6.26-2-alpha-generic, archname=alpha-linux-thread-multi
    uname='linux debauch 2.6.26-2-alpha-generic #1 tue mar 9 22:27:23 utc 2010 alpha gnulinux '
    config_args='-de -Dusedevel -Dprefix=/home/cpan/pit/rel/perl-5.13.0 -Dusethreads -Duse64bitint'
    hint=recommended, useposix=true, d_sigaction=define
    useithreads=define, usemultiplicity=define
    useperlio=define, d_sfio=undef, uselargefiles=define, usesocks=undef
    use64bitint=define, use64bitall=define, uselongdouble=undef
    usemymalloc=n, bincompat5005=undef
  Compiler:
    cc='cc', ccflags ='-D_REENTRANT -D_GNU_SOURCE -fno-strict-aliasing -pipe -I/usr/local/include -D_LARGEFILE_SOURCE -D_FILE_OFFSET_BITS=64',
    optimize='-O2',
    cppflags='-D_REENTRANT -D_GNU_SOURCE -fno-strict-aliasing -pipe -I/usr/local/include'
    ccversion='', gccversion='4.2.4 (Debian 4.2.4-6)', gccosandvers=''
    intsize=4, longsize=8, ptrsize=8, doublesize=8, byteorder=12345678
    d_longlong=define, longlongsize=8, d_longdbl=define, longdblsize=16
    ivtype='long', ivsize=8, nvtype='double', nvsize=8, Off_t='off_t', lseeksize=8
    alignbytes=8, prototype=define
  Linker and Libraries:
    ld='cc', ldflags =' -L/usr/local/lib'
    libpth=/usr/local/lib /lib /usr/lib
    libs=-lnsl -ldl -lm -lcrypt -lutil -lpthread -lc
    perllibs=-lnsl -ldl -lm -lcrypt -lutil -lpthread -lc
    libc=, so=so, useshrplib=false, libperl=libperl.a
    gnulibc_version='2.7'
  Dynamic Linking:
    dlsrc=dl_dlopen.xs, dlext=so, d_dlsymun=undef, ccdlflags='-Wl,-E'
    cccdlflags='-fPIC', lddlflags='-shared -O2 -L/usr/local/lib'


Characteristics of this binary (from libperl): 
  Compile-time options: MULTIPLICITY PERL_DONT_CREATE_GVSV
                        PERL_IMPLICIT_CONTEXT PERL_MALLOC_WRAP PERL_USE_DEVEL
                        USE_64_BIT_ALL USE_64_BIT_INT USE_ITHREADS
                        USE_LARGE_FILES USE_PERLIO USE_PERL_ATOF
                        USE_REENTRANT_API
  Built under linux
  Compiled at Apr 21 2010 11:10:39
  %ENV:
    PERL5LIB=":/home/cpan/pit/rel/conf/perl-5.13.0/.cpanplus/5.13.0/build/Alien-wxWidgets-0.51/blib/lib:/home/cpan/pit/rel/conf/perl-5.13.0/.cpanplus/5.13.0/build/Alien-wxWidgets-0.51/blib/arch:/home/cpan/pit/rel/conf/perl-5.13.0/.cpanplus/5.13.0/build/File-Next-1.06/blib/lib:/home/cpan/pit/rel/conf/perl-5.13.0/.cpanplus/5.13.0/build/File-Next-1.06/blib/arch:/home/cpan/pit/rel/conf/perl-5.13.0/.cpanplus/5.13.0/build/ack-1.92/blib/lib:/home/cpan/pit/rel/conf/perl-5.13.0/.cpanplus/5.13.0/build/ack-1.92/blib/arch:/home/cpan/pit/rel/conf/perl-5.13.0/.cpanplus/5.13.0/build/HTML-Tagset-3.20/blib/lib:/home/cpan/pit/rel/conf/perl-5.13.0/.cpanplus/5.13.0/build/HTML-Tagset-3.20/blib/arch:/home/cpan/pit/rel/conf/perl-5.13.0/.cpanplus/5.13.0/build/HTML-Parser-3.66/blib/lib:/home/cpan/pit/rel/conf/perl-5.13.0/.cpanplus/5.13.0/build/HTML-Parser-3.66/blib/arch:/home/cpan/pit/rel/conf/perl-5.13.0/.cpanplus/5.13.0/build/URI-1.54/blib/lib:/home/cpan/pit/rel/conf/perl-5.13.0/.cpanplus/5.13.0/build/URI-1.54/blib/arch:/home/cpan/pit/rel/conf/perl-5.13.0/.cpanplus/5.13.0/build/libwww-perl-5.836/blib/lib:/home/cpan/pit/rel/conf/perl-5.13.0/.cpanplus/5.13.0/build/libwww-perl-5.836/blib/arch:/home/cpan/pit/rel/conf/perl-5.13.0/.cpanplus/5.13.0/build/App-cpanminus-1.0010/blib/lib:/home/cpan/pit/rel/conf/perl-5.13.0/.cpanplus/5.13.0/build/App-cpanminus-1.0010/blib/arch:/home/cpan/pit/rel/conf/perl-5.13.0/.cpanplus/5.13.0/build/Capture-Tiny-0.08/blib/lib:/home/cpan/pit/rel/conf/perl-5.13.0/.cpanplus/5.13.0/build/Capture-Tiny-0.08/blib/arch:/home/cpan/pit/rel/conf/perl-5.13.0/.cpanplus/5.13.0/build/Class-Adapter-1.07/blib/lib:/home/cpan/pit/rel/conf/perl-5.13.0/.cpanplus/5.13.0/build/Class-Adapter-1.07/blib/arch:/home/cpan/pit/rel/conf/perl-5.13.0/.cpanplus/5.13.0/build/Class-Inspector-1.24/blib/lib:/home/cpan/pit/rel/conf/perl-5.13.0/.cpanplus/5.13.0/build/Class-Inspector-1.24/blib/arch:/home/cpan/pit/rel/conf/perl-5.13.0/.cpanplus/5.13.0/build/Class-Unload-0.06/blib/lib:/home/cpan/pit/rel/conf/perl-5.13.0/.cpanplus/5.13.0/build/Class-Unload-0.06/blib/arch:/home/cpan/pit/rel/conf/perl-5.13.0/.cpanplus/5.13.0/build/Class-XSAccessor-1.06/blib/lib:/home/cpan/pit/rel/conf/perl-5.13.0/.cpanplus/5.13.0/build/Class-XSAccessor-1.06/blib/arch:/home/cpan/pit/rel/conf/perl-5.13.0/.cpanplus/5.13.0/build/DBI-1.613/blib/lib:/home/cpan/pit/rel/conf/perl-5.13.0/.cpanplus/5.13.0/build/DBI-1.613/blib/arch:/home/cpan/pit/rel/conf/perl-5.13.0/.cpanplus/5.13.0/build/DBD-SQLite-1.29/blib/lib:/home/cpan/pit/rel/conf/perl-5.13.0/.cpanplus/5.13.0/build/DBD-SQLite-1.29/blib/arch:/home/cpan/pit/rel/conf/perl-5.13.0/.cpanplus/5.13.0/build/Test-Tester-0.107/blib/lib:/home/cpan/pit/rel/conf/perl-5.13.0/.cpanplus/5.13.0/build/Test-Tester-0.107/blib/arch:/home/cpan/pit/rel/conf/perl-5.13.0/.cpanplus/5.13.0/build/Test-NoWarnings-1.01/blib/lib:/home/cpan/pit/rel/conf/perl-5.13.0/.cpanplus/5.13.0/build/Test-NoWarnings-1.01/blib/arch:/home/cpan/pit/rel/conf/perl-5.13.0/.cpanplus/5.13.0/build/Test-Deep-0.106/blib/lib:/home/cpan/pit/rel/conf/perl-5.13.0/.cpanplus/5.13.0/build/Test-Deep-0.106/blib/arch:/home/cpan/pit/rel/conf/perl-5.13.0/.cpanplus/5.13.0/build/Debug-Client-0.11/blib/lib:/home/cpan/pit/rel/conf/perl-5.13.0/.cpanplus/5.13.0/build/Debug-Client-0.11/blib/arch:/home/cpan/pit/rel/conf/perl-5.13.0/.cpanplus/5.13.0/build/Devel-Dumpvar-1.06/blib/lib:/home/cpan/pit/rel/conf/perl-5.13.0/.cpanplus/5.13.0/build/Devel-Dumpvar-1.06/blib/arch:/home/cpan/pit/rel/conf/perl-5.13.0/.cpanplus/5.13.0/build/Devel-Refactor-0.05/blib/lib:/home/cpan/pit/rel/conf/perl-5.13.0/.cpanplus/5.13.0/build/Devel-Refactor-0.05/blib/arch:/home/cpan/pit/rel/conf/perl-5.13.0/.cpanplus/5.13.0/build/File-Copy-Recursive-0.38/blib/lib:/home/cpan/pit/rel/conf/perl-5.13.0/.cpanplus/5.13.0/build/File-Copy-Recursive-0.38/blib/arch:/home/cpan/pit/rel/conf/perl-5.13.0/.cpanplus/5.13.0/build/Number-Compare-0.01/blib/lib:/home/cpan/pit/rel/conf/perl-5.13.0/.cpanplus/5.13.0/build/Number-Compare-0.01/blib/arch:/home/cpan/pit/rel/conf/perl-5.13.0/.cpanplus/5.13.0/build/Text-Glob-0.08/blib/lib:/home/cpan/pit/rel/conf/perl-5.13.0/.cpanplus/5.13.0/build/Text-Glob-0.08/blib/arch:/home/cpan/pit/rel/conf/perl-5.13.0/.cpanplus/5.13.0/build/File-Find-Rule-0.32/blib/lib:/home/cpan/pit/rel/conf/perl-5.13.0/.cpanplus/5.13.0/build/File-Find-Rule-0.32/blib/arch:/home/cpan/pit/rel/conf/perl-5.13.0/.cpanplus/5.13.0/build/IPC-Run3-0.043/blib/lib:/home/cpan/pit/rel/conf/perl-5.13.0/.cpanplus/5.13.0/build/IPC-Run3-0.043/blib/arch:/home/cpan/pit/rel/conf/perl-5.13.0/.cpanplus/5.13.0/build/Probe-Perl-0.01/blib/lib:/home/cpan/pit/rel/conf/perl-5.13.0/.cpanplus/5.13.0/build/Probe-Perl-0.01/blib/arch:/home/cpan/pit/rel/conf/perl-5.13.0/.cpanplus/5.13.0/build/Test-Script-1.07/blib/lib:/home/cpan/pit/rel/conf/perl-5.13.0/.cpanplus/5.13.0/build/Test-Script-1.07/blib/arch:/home/cpan/pit/rel/conf/perl-5.13.0/.cpanplus/5.13.0/build/File-Which-1.09/blib/lib:/home/cpan/pit/rel/conf/perl-5.13.0/.cpanplus/5.13.0/build/File-Which-1.09/blib/arch:/home/cpan/pit/rel/conf/perl-5.13.0/.cpanplus/5.13.0/build/File-HomeDir-0.91/blib/lib:/home/cpan/pit/rel/conf/perl-5.13.0/.cpanplus/5.13.0/build/File-HomeDir-0.91/blib/arch:/home/cpan/pit/rel/conf/perl-5.13.0/.cpanplus/5.13.0/build/File-Remove-1.42/blib/lib:/home/cpan/pit/rel/conf/perl-5.13.0/.cpanplus/5.13.0/build/File-Remove-1.42/blib/arch:/home/cpan/pit/rel/conf/perl-5.13.0/.cpanplus/5.13.0/build/File-ShareDir-1.02/blib/lib:/home/cpan/pit/rel/conf/perl-5.13.0/.cpanplus/5.13.0/build/File-ShareDir-1.02/blib/arch:/home/cpan/pit/rel/conf/perl-5.13.0/.cpanplus/5.13.0/build/File-pushd-1.00/blib/lib:/home/cpan/pit/rel/conf/perl-5.13.0/.cpanplus/5.13.0/build/File-pushd-1.00/blib/arch:/home/cpan/pit/rel/conf/perl-5.13.0/.cpanplus/5.13.0/build/JSON-2.21/blib/lib:/home/cpan/pit/rel/conf/perl-5.13.0/.cpanplus/5.13.0/build/JSON-2.21/blib/arch:/home/cpan/pit/rel/conf/perl-5.13.0/.cpanplus/5.13.0/build/Module-ScanDeps-0.98/blib/lib:/home/cpan/pit/rel/conf/perl-5.13.0/.cpanplus/5.13.0/build/Module-ScanDeps-0.98/blib/arch:/home/cpan/pit/rel/conf/perl-5.13.0/.cpanplus/5.13.0/build/PAR-Dist-0.47/blib/lib:/home/cpan/pit/rel/conf/perl-5.13.0/.cpanplus/5.13.0/build/PAR-Dist-0.47/blib/arch:/home/cpan/pit/rel/conf/perl-5.13.0/.cpanplus/5.13.0/build/YAML-0.71/blib/lib:/home/cpan/pit/rel/conf/perl-5.13.0/.cpanplus/5.13.0/build/YAML-0.71/blib/arch:/home/cpan/pit/rel/conf/perl-5.13.0/.cpanplus/5.13.0/build/Error-0.17016/blib/lib:/home/cpan/pit/rel/conf/perl-5.13.0/.cpanplus/5.13.0/build/Error-0.17016/blib/arch:/home/cpan/pit/rel/conf/perl-5.13.0/.cpanplus/5.13.0/build/YAML-Perl-0.02/blib/lib:/home/cpan/pit/rel/conf/perl-5.13.0/.cpanplus/5.13.0/build/YAML-Perl-0.02/blib/arch:/home/cpan/pit/rel/conf/perl-5.13.0/.cpanplus/5.13.0/build/Devel-Leak-0.03/blib/lib:/home/cpan/pit/rel/conf/perl-5.13.0/.cpanplus/5.13.0/build/Devel-Leak-0.03/blib/arch:/home/cpan/pit/rel/conf/perl-5.13.0/.cpanplus/5.13.0/build/YAML-Syck-1.12/blib/lib:/home/cpan/pit/rel/conf/perl-5.13.0/.cpanplus/5.13.0/build/YAML-Syck-1.12/blib/arch:/home/cpan/pit/rel/conf/perl-5.13.0/.cpanplus/5.13.0/build/YAML-LibYAML-0.33/blib/lib:/home/cpan/pit/rel/conf/perl-5.13.0/.cpanplus/5.13.0/build/YAML-LibYAML-0.33/blib/arch:/home/cpan/pit/rel/conf/perl-5.13.0/.cpanplus/5.13.0/build/YAML-Tiny-1.44/blib/lib:/home/cpan/pit/rel/conf/perl-5.13.0/.cpanplus/5.13.0/build/YAML-Tiny-1.44/blib/arch:/home/cpan/pit/rel/conf/perl-5.13.0/.cpanplus/5.13.0/build/Module-Install-1.00/blib/lib:/home/cpan/pit/rel/conf/perl-5.13.0/.cpanplus/5.13.0/build/Module-Install-1.00/blib/arch:/home/cpan/pit/rel/conf/perl-5.13.0/.cpanplus/5.13.0/build/Format-Human-Bytes-0.05/blib/lib:/home/cpan/pit/rel/conf/perl-5.13.0/.cpanplus/5.13.0/build/Format-Human-Bytes-0.05/blib/arch:/home/cpan/pit/rel/conf/perl-5.13.0/.cpanplus/5.13.0/build/IO-stringy-2.110/blib/lib:/home/cpan/pit/rel/conf/perl-5.13.0/.cpanplus/5.13.0/build/IO-stringy-2.110/blib/arch:/home/cpan/pit/rel/conf/perl-5.13.0/.cpanplus/5.13.0/build/IO-String-1.08/blib/lib:/home/cpan/pit/rel/conf/perl-5.13.0/.cpanplus/5.13.0/build/IO-String-1.08/blib/arch:/home/cpan/pit/rel/conf/perl-5.13.0/.cpanplus/5.13.0/build/List-MoreUtils-0.22/blib/lib:/home/cpan/pit/rel/conf/perl-5.13.0/.cpanplus/5.13.0/build/List-MoreUtils-0.22/blib/arch:/home/cpan/pit/rel/conf/perl-5.13.0/.cpanplus/5.13.0/build/Locale-Maketext-Gettext-1.28/blib/lib:/home/cpan/pit/rel/conf/perl-5.13.0/.cpanplus/5.13.0/build/Locale-Maketext-Gettext-1.28/blib/arch:/home/cpan/pit/rel/conf/perl-5.13.0/.cpanplus/5.13.0/build/Locale-Msgfmt-0.14/blib/lib:/home/cpan/pit/rel/conf/perl-5.13.0/.cpanplus/5.13.0/build/Locale-Msgfmt-0.14/blib/arch:/home/cpan/pit/rel/conf/perl-5.13.0/.cpanplus/5.13.0/build/Params-Util-1.01/blib/lib:/home/cpan/pit/rel/conf/perl-5.13.0/.cpanplus/5.13.0/build/Params-Util-1.01/blib/arch:/home/cpan/pit/rel/conf/perl-5.13.0/.cpanplus/5.13.0/build/Sub-Uplevel-0.22/blib/lib:/home/cpan/pit/rel/conf/perl-5.13.0/.cpanplus/5.13.0/build/Sub-Uplevel-0.22/blib/arch:/home/cpan/pit/rel/conf/perl-5.13.0/.cpanplus/5.13.0/build/Test-Exception-0.29/blib/lib:/home/cpan/pit/rel/conf/perl-5.13.0/.cpanplus/5.13.0/build/Test-Exception-0.29/blib/arch:/home/cpan/pit/rel/conf/perl-5.13.0/.cpanplus/5.13.0/build/Tree-DAG_Node-1.06/blib/lib:/home/cpan/pit/rel/conf/perl-5.13.0/.cpanplus/5.13.0/build/Tree-DAG_Node-1.06/blib/arch:/home/cpan/pit/rel/conf/perl-5.13.0/.cpanplus/5.13.0/build/Test-Warn-0.21/blib/lib:/home/cpan/pit/rel/conf/perl-5.13.0/.cpanplus/5.13.0/build/Test-Warn-0.21/blib/arch:/home/cpan/pit/rel/conf/perl-5.13.0/.cpanplus/5.13.0/build/Module-Manifest-1.08/blib/lib:/home/cpan/pit/rel/conf/perl-5.13.0/.cpanplus/5.13.0/build/Module-Manifest-1.08/blib/arch:/home/cpan/pit/rel/conf/perl-5.13.0/.cpanplus/5.13.0/build/Module-Refresh-0.13/blib/lib:/home/cpan/pit/rel/conf/perl-5.13.0/.cpanplus/5.13.0/build/Module-Refresh-0.13/blib/arch:/home/cpan/pit/rel/conf/perl-5.13.0/.cpanplus/5.13.0/build/Module-Starter-1.54/blib/lib:/home/cpan/pit/rel/conf/perl-5.13.0/.cpanplus/5.13.0/build/Module-Starter-1.54/blib/arch:/home/cpan/pit/rel/conf/perl-5.13.0/.cpanplus/5.13.0/build/ORLite-1.45/blib/lib:/home/cpan/pit/rel/conf/perl-5.13.0/.cpanplus/5.13.0/build/ORLite-1.45/blib/arch:/home/cpan/pit/rel/conf/perl-5.13.0/.cpanplus/5.13.0/build/POD2-Base-0.043/blib/lib:/home/cpan/pit/rel/conf/perl-5.13.0/.cpanplus/5.13.0/build/POD2-Base-0.043/blib/arch:/home/cpan/pit/rel/conf/perl-5.13.0/.cpanplus/5.13.0/build/Clone-0.31/blib/lib:/home/cpan/pit/rel/conf/perl-5.13.0/.cpanplus/5.13.0/build/Clone-0.31/blib/arch:/home/cpan/pit/rel/conf/perl-5.13.0/.cpanplus/5.13.0/build/Task-Weaken-1.03/blib/lib:/home/cpan/pit/rel/conf/perl-5.13.0/.cpanplus/5.13.0/build/Task-Weaken-1.03/blib/arch:/home/cpan/pit/rel/conf/perl-5.13.0/.cpanplus/5.13.0/build/Test-Object-0.07/blib/lib:/home/cpan/pit/rel/conf/perl-5.13.0/.cpanplus/5.13.0/build/Test-Object-0.07/blib/arch:/home/cpan/pit/rel/conf/perl-5.13.0/.cpanplus/5.13.0/build/Hook-LexWrap-0.23/blib/lib:/home/cpan/pit/rel/conf/perl-5.13.0/.cpanplus/5.13.0/build/Hook-LexWrap-0.23/blib/arch:/home/cpan/pit/rel/conf/perl-5.13.0/.cpanplus/5.13.0/build/Test-SubCalls-1.09/blib/lib:/home/cpan/pit/rel/conf/perl-5.13.0/.cpanplus/5.13.0/build/Test-SubCalls-1.09/blib/arch:/home/cpan/pit/rel/conf/perl-5.13.0/.cpanplus/5.13.0/build/PPI-1.213/blib/lib:/home/cpan/pit/rel/conf/perl-5.13.0/.cpanplus/5.13.0/build/PPI-1.213/blib/arch:/home/cpan/pit/rel/conf/perl-5.13.0/.cpanplus/5.13.0/build/Algorithm-Diff-1.1902/blib/lib:/home/cpan/pit/rel/conf/perl-5.13.0/.cpanplus/5.13.0/build/Algorithm-Diff-1.1902/blib/arch:/home/cpan/pit/rel/conf/perl-5.13.0/.cpanplus/5.13.0/build/Text-Diff-1.37/blib/lib:/home/cpan/pit/rel/conf/perl-5.13.0/.cpanplus/5.13.0/build/Text-Diff-1.37/blib/arch:/home/cpan/pit/rel/conf/perl-5.13.0/.cpanplus/5.13.0/build/Test-Differences-0.500/blib/lib:/home/cpan/pit/rel/conf/perl-5.13.0/.cpanplus/5.13.0/build/Test-Differences-0.500/blib/arch:/home/cpan/pit/rel/conf/perl-5.13.0/.cpanplus/5.13.0/build/PPIx-EditorTools-0.09/blib/lib:/home/cpan/pit/rel/conf/perl-5.13.0/.cpanplus/5.13.0/build/PPIx-EditorTools-0.09/blib/arch:/home/cpan/pit/rel/conf/perl-5.13.0/.cpanplus/5.13.0/build/Readonly-1.03/blib/lib:/home/cpan/pit/rel/conf/perl-5.13.0/.cpanplus/5.13.0/build/Readonly-1.03/blib/arch:/home/cpan/pit/rel/conf/perl-5.13.0/.cpanplus/5.13.0/build/PPIx-Regexp-0.010/blib/lib:/home/cpan/pit/rel/conf/perl-5.13.0/.cpanplus/5.13.0/build/PPIx-Regexp-0.010/blib/arch:/home/cpan/pit/rel/conf/perl-5.13.0/.cpanplus/5.13.0/build/File-Slurp-9999.13/blib/lib:/home/cpan/pit/rel/conf/perl-5.13.0/.cpanplus/5.13.0/build/File-Slurp-9999.13/blib/arch:/home/cpan/pit/rel/conf/perl-5.13.0/.cpanplus/5.13.0/build/Pod-POM-0.27/blib/lib:/home/cpan/pit/rel/conf/perl-5.13.0/.cpanplus/5.13.0/build/Pod-POM-0.27/blib/arch:/home/cpan/pit/rel/conf/perl-5.13.0/.cpanplus/5.13.0/build/Parse-ErrorString-Perl-0.13/blib/lib:/home/cpan/pit/rel/conf/perl-5.13.0/.cpanplus/5.13.0/build/Parse-ErrorString-Perl-0.13/blib/arch:/home/cpan/pit/rel/conf/perl-5.13.0/.cpanplus/5.13.0/build/Parse-ExuberantCTags-1.01/blib/lib:/home/cpan/pit/rel/conf/perl-5.13.0/.cpanplus/5.13.0/build/Parse-ExuberantCTags-1.01/blib/arch:/home/cpan/pit/rel/conf/perl-5.13.0/.cpanplus/5.13.0/build/Pod-Abstract-0.20/blib/lib:/home/cpan/pit/rel/conf/perl-5.13.0/.cpanplus/5.13.0/build/Pod-Abstract-0.20/blib/arch:/home/cpan/pit/rel/conf/perl-5.13.0/.cpanplus/5.13.0/build/Readonly-XS-1.05/blib/lib:/home/cpan/pit/rel/conf/perl-5.13.0/.cpanplus/5.13.0/build/Readonly-XS-1.05/blib/arch:/home/cpan/pit/rel/conf/perl-5.13.0/.cpanplus/5.13.0/build/Template-Tiny-0.11/blib/lib:/home/cpan/pit/rel/conf/perl-5.13.0/.cpanplus/5.13.0/build/Template-Tiny-0.11/blib/arch:/home/cpan/pit/rel/conf/perl-5.13.0/.cpanplus/5.13.0/build/Scalar-List-Utils-1.23/blib/lib:/home/cpan/pit/rel/conf/perl-5.13.0/.cpanplus/5.13.0/build/Scalar-List-Utils-1.23/blib/arch:/home/cpan/pit/rel/conf/perl-5.13.0/.cpanplus/5.13.0/build/UNIVERSAL-can-1.16/blib/lib:/home/cpan/pit/rel/conf/perl-5.13.0/.cpanplus/5.13.0/build/UNIVERSAL-can-1.16/blib/arch:/home/cpan/pit/rel/conf/perl-5.13.0/.cpanplus/5.13.0/build/UNIVERSAL-isa-1.03/blib/lib:/home/cpan/pit/rel/conf/perl-5.13.0/.cpanplus/5.13.0/build/UNIVERSAL-isa-1.03/blib/arch:/home/cpan/pit/rel/conf/perl-5.13.0/.cpanplus/5.13.0/build/Test-MockObject-1.09/blib/lib:/home/cpan/pit/rel/conf/perl-5.13.0/.cpanplus/5.13.0/build/Test-MockObject-1.09/blib/arch:/home/cpan/pit/rel/conf/perl-5.13.0/.cpanplus/5.13.0/build/Text-FindIndent-0.08/blib/lib:/home/cpan/pit/rel/conf/perl-5.13.0/.cpanplus/5.13.0/build/Text-FindIndent-0.08/blib/arch:/home/cpan/pit/rel/conf/perl-5.13.0/.cpanplus/5.13.0/build/Spiffy-0.30/blib/lib:/home/cpan/pit/rel/conf/perl-5.13.0/.cpanplus/5.13.0/build/Spiffy-0.30/blib/arch:/home/cpan/pit/rel/conf/perl-5.13.0/.cpanplus/5.13.0/build/Test-Base-0.59/blib/lib:/home/cpan/pit/rel/conf/perl-5.13.0/.cpanplus/5.13.0/build/Test-Base-0.59/blib/arch:/home/cpan/pit/rel/conf/perl-5.13.0/.cpanplus/5.13.0/build/ExtUtils-XSpp-0.15/blib/lib:/home/cpan/pit/rel/conf/perl-5.13.0/.cpanplus/5.13.0/build/ExtUtils-XSpp-0.15/blib/arch"
    PERL5_CPANPLUS_IS_RUNNING="23153"
    PERL5_CPANPLUS_IS_VERSION="0.9007"
    PERL5_MINISMOKEBOX="0.26"
    PERL5_YACSMOKE_BASE="/home/cpan/pit/rel/conf/perl-5.13.0"
    PERL_EXTUTILS_AUTOINSTALL="--defaultdeps"
    PERL_MM_USE_DEFAULT="1"
  @INC:
    /home/cpan/pit/rel/conf/perl-5.13.0/.cpanplus/5.13.0/build/Alien-wxWidgets-0.51/blib/lib
    /home/cpan/pit/rel/conf/perl-5.13.0/.cpanplus/5.13.0/build/Alien-wxWidgets-0.51/blib/arch
    /home/cpan/pit/rel/conf/perl-5.13.0/.cpanplus/5.13.0/build/File-Next-1.06/blib/lib
    /home/cpan/pit/rel/conf/perl-5.13.0/.cpanplus/5.13.0/build/File-Next-1.06/blib/arch
    /home/cpan/pit/rel/conf/perl-5.13.0/.cpanplus/5.13.0/build/ack-1.92/blib/lib
    /home/cpan/pit/rel/conf/perl-5.13.0/.cpanplus/5.13.0/build/ack-1.92/blib/arch
    /home/cpan/pit/rel/conf/perl-5.13.0/.cpanplus/5.13.0/build/HTML-Tagset-3.20/blib/lib
    /home/cpan/pit/rel/conf/perl-5.13.0/.cpanplus/5.13.0/build/HTML-Tagset-3.20/blib/arch
    /home/cpan/pit/rel/conf/perl-5.13.0/.cpanplus/5.13.0/build/HTML-Parser-3.66/blib/lib
    /home/cpan/pit/rel/conf/perl-5.13.0/.cpanplus/5.13.0/build/HTML-Parser-3.66/blib/arch
    /home/cpan/pit/rel/conf/perl-5.13.0/.cpanplus/5.13.0/build/URI-1.54/blib/lib
    /home/cpan/pit/rel/conf/perl-5.13.0/.cpanplus/5.13.0/build/URI-1.54/blib/arch
    /home/cpan/pit/rel/conf/perl-5.13.0/.cpanplus/5.13.0/build/libwww-perl-5.836/blib/lib
    /home/cpan/pit/rel/conf/perl-5.13.0/.cpanplus/5.13.0/build/libwww-perl-5.836/blib/arch
    /home/cpan/pit/rel/conf/perl-5.13.0/.cpanplus/5.13.0/build/App-cpanminus-1.0010/blib/lib
    /home/cpan/pit/rel/conf/perl-5.13.0/.cpanplus/5.13.0/build/App-cpanminus-1.0010/blib/arch
    /home/cpan/pit/rel/conf/perl-5.13.0/.cpanplus/5.13.0/build/Capture-Tiny-0.08/blib/lib
    /home/cpan/pit/rel/conf/perl-5.13.0/.cpanplus/5.13.0/build/Capture-Tiny-0.08/blib/arch
    /home/cpan/pit/rel/conf/perl-5.13.0/.cpanplus/5.13.0/build/Class-Adapter-1.07/blib/lib
    /home/cpan/pit/rel/conf/perl-5.13.0/.cpanplus/5.13.0/build/Class-Adapter-1.07/blib/arch
    /home/cpan/pit/rel/conf/perl-5.13.0/.cpanplus/5.13.0/build/Class-Inspector-1.24/blib/lib
    /home/cpan/pit/rel/conf/perl-5.13.0/.cpanplus/5.13.0/build/Class-Inspector-1.24/blib/arch
    /home/cpan/pit/rel/conf/perl-5.13.0/.cpanplus/5.13.0/build/Class-Unload-0.06/blib/lib
    /home/cpan/pit/rel/conf/perl-5.13.0/.cpanplus/5.13.0/build/Class-Unload-0.06/blib/arch
    /home/cpan/pit/rel/conf/perl-5.13.0/.cpanplus/5.13.0/build/Class-XSAccessor-1.06/blib/lib
    /home/cpan/pit/rel/conf/perl-5.13.0/.cpanplus/5.13.0/build/Class-XSAccessor-1.06/blib/arch
    /home/cpan/pit/rel/conf/perl-5.13.0/.cpanplus/5.13.0/build/DBI-1.613/blib/lib
    /home/cpan/pit/rel/conf/perl-5.13.0/.cpanplus/5.13.0/build/DBI-1.613/blib/arch
    /home/cpan/pit/rel/conf/perl-5.13.0/.cpanplus/5.13.0/build/DBD-SQLite-1.29/blib/lib
    /home/cpan/pit/rel/conf/perl-5.13.0/.cpanplus/5.13.0/build/DBD-SQLite-1.29/blib/arch
    /home/cpan/pit/rel/conf/perl-5.13.0/.cpanplus/5.13.0/build/Test-Tester-0.107/blib/lib
    /home/cpan/pit/rel/conf/perl-5.13.0/.cpanplus/5.13.0/build/Test-Tester-0.107/blib/arch
    /home/cpan/pit/rel/conf/perl-5.13.0/.cpanplus/5.13.0/build/Test-NoWarnings-1.01/blib/lib
    /home/cpan/pit/rel/conf/perl-5.13.0/.cpanplus/5.13.0/build/Test-NoWarnings-1.01/blib/arch
    /home/cpan/pit/rel/conf/perl-5.13.0/.cpanplus/5.13.0/build/Test-Deep-0.106/blib/lib
    /home/cpan/pit/rel/conf/perl-5.13.0/.cpanplus/5.13.0/build/Test-Deep-0.106/blib/arch
    /home/cpan/pit/rel/conf/perl-5.13.0/.cpanplus/5.13.0/build/Debug-Client-0.11/blib/lib
    /home/cpan/pit/rel/conf/perl-5.13.0/.cpanplus/5.13.0/build/Debug-Client-0.11/blib/arch
    /home/cpan/pit/rel/conf/perl-5.13.0/.cpanplus/5.13.0/build/Devel-Dumpvar-1.06/blib/lib
    /home/cpan/pit/rel/conf/perl-5.13.0/.cpanplus/5.13.0/build/Devel-Dumpvar-1.06/blib/arch
    /home/cpan/pit/rel/conf/perl-5.13.0/.cpanplus/5.13.0/build/Devel-Refactor-0.05/blib/lib
    /home/cpan/pit/rel/conf/perl-5.13.0/.cpanplus/5.13.0/build/Devel-Refactor-0.05/blib/arch
    /home/cpan/pit/rel/conf/perl-5.13.0/.cpanplus/5.13.0/build/File-Copy-Recursive-0.38/blib/lib
    /home/cpan/pit/rel/conf/perl-5.13.0/.cpanplus/5.13.0/build/File-Copy-Recursive-0.38/blib/arch
    /home/cpan/pit/rel/conf/perl-5.13.0/.cpanplus/5.13.0/build/Number-Compare-0.01/blib/lib
    /home/cpan/pit/rel/conf/perl-5.13.0/.cpanplus/5.13.0/build/Number-Compare-0.01/blib/arch
    /home/cpan/pit/rel/conf/perl-5.13.0/.cpanplus/5.13.0/build/Text-Glob-0.08/blib/lib
    /home/cpan/pit/rel/conf/perl-5.13.0/.cpanplus/5.13.0/build/Text-Glob-0.08/blib/arch
    /home/cpan/pit/rel/conf/perl-5.13.0/.cpanplus/5.13.0/build/File-Find-Rule-0.32/blib/lib
    /home/cpan/pit/rel/conf/perl-5.13.0/.cpanplus/5.13.0/build/File-Find-Rule-0.32/blib/arch
    /home/cpan/pit/rel/conf/perl-5.13.0/.cpanplus/5.13.0/build/IPC-Run3-0.043/blib/lib
    /home/cpan/pit/rel/conf/perl-5.13.0/.cpanplus/5.13.0/build/IPC-Run3-0.043/blib/arch
    /home/cpan/pit/rel/conf/perl-5.13.0/.cpanplus/5.13.0/build/Probe-Perl-0.01/blib/lib
    /home/cpan/pit/rel/conf/perl-5.13.0/.cpanplus/5.13.0/build/Probe-Perl-0.01/blib/arch
    /home/cpan/pit/rel/conf/perl-5.13.0/.cpanplus/5.13.0/build/Test-Script-1.07/blib/lib
    /home/cpan/pit/rel/conf/perl-5.13.0/.cpanplus/5.13.0/build/Test-Script-1.07/blib/arch
    /home/cpan/pit/rel/conf/perl-5.13.0/.cpanplus/5.13.0/build/File-Which-1.09/blib/lib
    /home/cpan/pit/rel/conf/perl-5.13.0/.cpanplus/5.13.0/build/File-Which-1.09/blib/arch
    /home/cpan/pit/rel/conf/perl-5.13.0/.cpanplus/5.13.0/build/File-HomeDir-0.91/blib/lib
    /home/cpan/pit/rel/conf/perl-5.13.0/.cpanplus/5.13.0/build/File-HomeDir-0.91/blib/arch
    /home/cpan/pit/rel/conf/perl-5.13.0/.cpanplus/5.13.0/build/File-Remove-1.42/blib/lib
    /home/cpan/pit/rel/conf/perl-5.13.0/.cpanplus/5.13.0/build/File-Remove-1.42/blib/arch
    /home/cpan/pit/rel/conf/perl-5.13.0/.cpanplus/5.13.0/build/File-ShareDir-1.02/blib/lib
    /home/cpan/pit/rel/conf/perl-5.13.0/.cpanplus/5.13.0/build/File-ShareDir-1.02/blib/arch
    /home/cpan/pit/rel/conf/perl-5.13.0/.cpanplus/5.13.0/build/File-pushd-1.00/blib/lib
    /home/cpan/pit/rel/conf/perl-5.13.0/.cpanplus/5.13.0/build/File-pushd-1.00/blib/arch
    /home/cpan/pit/rel/conf/perl-5.13.0/.cpanplus/5.13.0/build/JSON-2.21/blib/lib
    /home/cpan/pit/rel/conf/perl-5.13.0/.cpanplus/5.13.0/build/JSON-2.21/blib/arch
    /home/cpan/pit/rel/conf/perl-5.13.0/.cpanplus/5.13.0/build/Module-ScanDeps-0.98/blib/lib
    /home/cpan/pit/rel/conf/perl-5.13.0/.cpanplus/5.13.0/build/Module-ScanDeps-0.98/blib/arch
    /home/cpan/pit/rel/conf/perl-5.13.0/.cpanplus/5.13.0/build/PAR-Dist-0.47/blib/lib
    /home/cpan/pit/rel/conf/perl-5.13.0/.cpanplus/5.13.0/build/PAR-Dist-0.47/blib/arch
    /home/cpan/pit/rel/conf/perl-5.13.0/.cpanplus/5.13.0/build/YAML-0.71/blib/lib
    /home/cpan/pit/rel/conf/perl-5.13.0/.cpanplus/5.13.0/build/YAML-0.71/blib/arch
    /home/cpan/pit/rel/conf/perl-5.13.0/.cpanplus/5.13.0/build/Error-0.17016/blib/lib
    /home/cpan/pit/rel/conf/perl-5.13.0/.cpanplus/5.13.0/build/Error-0.17016/blib/arch
    /home/cpan/pit/rel/conf/perl-5.13.0/.cpanplus/5.13.0/build/YAML-Perl-0.02/blib/lib
    /home/cpan/pit/rel/conf/perl-5.13.0/.cpanplus/5.13.0/build/YAML-Perl-0.02/blib/arch
    /home/cpan/pit/rel/conf/perl-5.13.0/.cpanplus/5.13.0/build/Devel-Leak-0.03/blib/lib
    /home/cpan/pit/rel/conf/perl-5.13.0/.cpanplus/5.13.0/build/Devel-Leak-0.03/blib/arch
    /home/cpan/pit/rel/conf/perl-5.13.0/.cpanplus/5.13.0/build/YAML-Syck-1.12/blib/lib
    /home/cpan/pit/rel/conf/perl-5.13.0/.cpanplus/5.13.0/build/YAML-Syck-1.12/blib/arch
    /home/cpan/pit/rel/conf/perl-5.13.0/.cpanplus/5.13.0/build/YAML-LibYAML-0.33/blib/lib
    /home/cpan/pit/rel/conf/perl-5.13.0/.cpanplus/5.13.0/build/YAML-LibYAML-0.33/blib/arch
    /home/cpan/pit/rel/conf/perl-5.13.0/.cpanplus/5.13.0/build/YAML-Tiny-1.44/blib/lib
    /home/cpan/pit/rel/conf/perl-5.13.0/.cpanplus/5.13.0/build/YAML-Tiny-1.44/blib/arch
    /home/cpan/pit/rel/conf/perl-5.13.0/.cpanplus/5.13.0/build/Module-Install-1.00/blib/lib
    /home/cpan/pit/rel/conf/perl-5.13.0/.cpanplus/5.13.0/build/Module-Install-1.00/blib/arch
    /home/cpan/pit/rel/conf/perl-5.13.0/.cpanplus/5.13.0/build/Format-Human-Bytes-0.05/blib/lib
    /home/cpan/pit/rel/conf/perl-5.13.0/.cpanplus/5.13.0/build/Format-Human-Bytes-0.05/blib/arch
    /home/cpan/pit/rel/conf/perl-5.13.0/.cpanplus/5.13.0/build/IO-stringy-2.110/blib/lib
    /home/cpan/pit/rel/conf/perl-5.13.0/.cpanplus/5.13.0/build/IO-stringy-2.110/blib/arch
    /home/cpan/pit/rel/conf/perl-5.13.0/.cpanplus/5.13.0/build/IO-String-1.08/blib/lib
    /home/cpan/pit/rel/conf/perl-5.13.0/.cpanplus/5.13.0/build/IO-String-1.08/blib/arch
    /home/cpan/pit/rel/conf/perl-5.13.0/.cpanplus/5.13.0/build/List-MoreUtils-0.22/blib/lib
    /home/cpan/pit/rel/conf/perl-5.13.0/.cpanplus/5.13.0/build/List-MoreUtils-0.22/blib/arch
    /home/cpan/pit/rel/conf/perl-5.13.0/.cpanplus/5.13.0/build/Locale-Maketext-Gettext-1.28/blib/lib
    /home/cpan/pit/rel/conf/perl-5.13.0/.cpanplus/5.13.0/build/Locale-Maketext-Gettext-1.28/blib/arch
    /home/cpan/pit/rel/conf/perl-5.13.0/.cpanplus/5.13.0/build/Locale-Msgfmt-0.14/blib/lib
    /home/cpan/pit/rel/conf/perl-5.13.0/.cpanplus/5.13.0/build/Locale-Msgfmt-0.14/blib/arch
    /home/cpan/pit/rel/conf/perl-5.13.0/.cpanplus/5.13.0/build/Params-Util-1.01/blib/lib
    /home/cpan/pit/rel/conf/perl-5.13.0/.cpanplus/5.13.0/build/Params-Util-1.01/blib/arch
    /home/cpan/pit/rel/conf/perl-5.13.0/.cpanplus/5.13.0/build/Sub-Uplevel-0.22/blib/lib
    /home/cpan/pit/rel/conf/perl-5.13.0/.cpanplus/5.13.0/build/Sub-Uplevel-0.22/blib/arch
    /home/cpan/pit/rel/conf/perl-5.13.0/.cpanplus/5.13.0/build/Test-Exception-0.29/blib/lib
    /home/cpan/pit/rel/conf/perl-5.13.0/.cpanplus/5.13.0/build/Test-Exception-0.29/blib/arch
    /home/cpan/pit/rel/conf/perl-5.13.0/.cpanplus/5.13.0/build/Tree-DAG_Node-1.06/blib/lib
    /home/cpan/pit/rel/conf/perl-5.13.0/.cpanplus/5.13.0/build/Tree-DAG_Node-1.06/blib/arch
    /home/cpan/pit/rel/conf/perl-5.13.0/.cpanplus/5.13.0/build/Test-Warn-0.21/blib/lib
    /home/cpan/pit/rel/conf/perl-5.13.0/.cpanplus/5.13.0/build/Test-Warn-0.21/blib/arch
    /home/cpan/pit/rel/conf/perl-5.13.0/.cpanplus/5.13.0/build/Module-Manifest-1.08/blib/lib
    /home/cpan/pit/rel/conf/perl-5.13.0/.cpanplus/5.13.0/build/Module-Manifest-1.08/blib/arch
    /home/cpan/pit/rel/conf/perl-5.13.0/.cpanplus/5.13.0/build/Module-Refresh-0.13/blib/lib
    /home/cpan/pit/rel/conf/perl-5.13.0/.cpanplus/5.13.0/build/Module-Refresh-0.13/blib/arch
    /home/cpan/pit/rel/conf/perl-5.13.0/.cpanplus/5.13.0/build/Module-Starter-1.54/blib/lib
    /home/cpan/pit/rel/conf/perl-5.13.0/.cpanplus/5.13.0/build/Module-Starter-1.54/blib/arch
    /home/cpan/pit/rel/conf/perl-5.13.0/.cpanplus/5.13.0/build/ORLite-1.45/blib/lib
    /home/cpan/pit/rel/conf/perl-5.13.0/.cpanplus/5.13.0/build/ORLite-1.45/blib/arch
    /home/cpan/pit/rel/conf/perl-5.13.0/.cpanplus/5.13.0/build/POD2-Base-0.043/blib/lib
    /home/cpan/pit/rel/conf/perl-5.13.0/.cpanplus/5.13.0/build/POD2-Base-0.043/blib/arch
    /home/cpan/pit/rel/conf/perl-5.13.0/.cpanplus/5.13.0/build/Clone-0.31/blib/lib
    /home/cpan/pit/rel/conf/perl-5.13.0/.cpanplus/5.13.0/build/Clone-0.31/blib/arch
    /home/cpan/pit/rel/conf/perl-5.13.0/.cpanplus/5.13.0/build/Task-Weaken-1.03/blib/lib
    /home/cpan/pit/rel/conf/perl-5.13.0/.cpanplus/5.13.0/build/Task-Weaken-1.03/blib/arch
    /home/cpan/pit/rel/conf/perl-5.13.0/.cpanplus/5.13.0/build/Test-Object-0.07/blib/lib
    /home/cpan/pit/rel/conf/perl-5.13.0/.cpanplus/5.13.0/build/Test-Object-0.07/blib/arch
    /home/cpan/pit/rel/conf/perl-5.13.0/.cpanplus/5.13.0/build/Hook-LexWrap-0.23/blib/lib
    /home/cpan/pit/rel/conf/perl-5.13.0/.cpanplus/5.13.0/build/Hook-LexWrap-0.23/blib/arch
    /home/cpan/pit/rel/conf/perl-5.13.0/.cpanplus/5.13.0/build/Test-SubCalls-1.09/blib/lib
    /home/cpan/pit/rel/conf/perl-5.13.0/.cpanplus/5.13.0/build/Test-SubCalls-1.09/blib/arch
    /home/cpan/pit/rel/conf/perl-5.13.0/.cpanplus/5.13.0/build/PPI-1.213/blib/lib
    /home/cpan/pit/rel/conf/perl-5.13.0/.cpanplus/5.13.0/build/PPI-1.213/blib/arch
    /home/cpan/pit/rel/conf/perl-5.13.0/.cpanplus/5.13.0/build/Algorithm-Diff-1.1902/blib/lib
    /home/cpan/pit/rel/conf/perl-5.13.0/.cpanplus/5.13.0/build/Algorithm-Diff-1.1902/blib/arch
    /home/cpan/pit/rel/conf/perl-5.13.0/.cpanplus/5.13.0/build/Text-Diff-1.37/blib/lib
    /home/cpan/pit/rel/conf/perl-5.13.0/.cpanplus/5.13.0/build/Text-Diff-1.37/blib/arch
    /home/cpan/pit/rel/conf/perl-5.13.0/.cpanplus/5.13.0/build/Test-Differences-0.500/blib/lib
    /home/cpan/pit/rel/conf/perl-5.13.0/.cpanplus/5.13.0/build/Test-Differences-0.500/blib/arch
    /home/cpan/pit/rel/conf/perl-5.13.0/.cpanplus/5.13.0/build/PPIx-EditorTools-0.09/blib/lib
    /home/cpan/pit/rel/conf/perl-5.13.0/.cpanplus/5.13.0/build/PPIx-EditorTools-0.09/blib/arch
    /home/cpan/pit/rel/conf/perl-5.13.0/.cpanplus/5.13.0/build/Readonly-1.03/blib/lib
    /home/cpan/pit/rel/conf/perl-5.13.0/.cpanplus/5.13.0/build/Readonly-1.03/blib/arch
    /home/cpan/pit/rel/conf/perl-5.13.0/.cpanplus/5.13.0/build/PPIx-Regexp-0.010/blib/lib
    /home/cpan/pit/rel/conf/perl-5.13.0/.cpanplus/5.13.0/build/PPIx-Regexp-0.010/blib/arch
    /home/cpan/pit/rel/conf/perl-5.13.0/.cpanplus/5.13.0/build/File-Slurp-9999.13/blib/lib
    /home/cpan/pit/rel/conf/perl-5.13.0/.cpanplus/5.13.0/build/File-Slurp-9999.13/blib/arch
    /home/cpan/pit/rel/conf/perl-5.13.0/.cpanplus/5.13.0/build/Pod-POM-0.27/blib/lib
    /home/cpan/pit/rel/conf/perl-5.13.0/.cpanplus/5.13.0/build/Pod-POM-0.27/blib/arch
    /home/cpan/pit/rel/conf/perl-5.13.0/.cpanplus/5.13.0/build/Parse-ErrorString-Perl-0.13/blib/lib
    /home/cpan/pit/rel/conf/perl-5.13.0/.cpanplus/5.13.0/build/Parse-ErrorString-Perl-0.13/blib/arch
    /home/cpan/pit/rel/conf/perl-5.13.0/.cpanplus/5.13.0/build/Parse-ExuberantCTags-1.01/blib/lib
    /home/cpan/pit/rel/conf/perl-5.13.0/.cpanplus/5.13.0/build/Parse-ExuberantCTags-1.01/blib/arch
    /home/cpan/pit/rel/conf/perl-5.13.0/.cpanplus/5.13.0/build/Pod-Abstract-0.20/blib/lib
    /home/cpan/pit/rel/conf/perl-5.13.0/.cpanplus/5.13.0/build/Pod-Abstract-0.20/blib/arch
    /home/cpan/pit/rel/conf/perl-5.13.0/.cpanplus/5.13.0/build/Readonly-XS-1.05/blib/lib
    /home/cpan/pit/rel/conf/perl-5.13.0/.cpanplus/5.13.0/build/Readonly-XS-1.05/blib/arch
    /home/cpan/pit/rel/conf/perl-5.13.0/.cpanplus/5.13.0/build/Template-Tiny-0.11/blib/lib
    /home/cpan/pit/rel/conf/perl-5.13.0/.cpanplus/5.13.0/build/Template-Tiny-0.11/blib/arch
    /home/cpan/pit/rel/conf/perl-5.13.0/.cpanplus/5.13.0/build/Scalar-List-Utils-1.23/blib/lib
    /home/cpan/pit/rel/conf/perl-5.13.0/.cpanplus/5.13.0/build/Scalar-List-Utils-1.23/blib/arch
    /home/cpan/pit/rel/conf/perl-5.13.0/.cpanplus/5.13.0/build/UNIVERSAL-can-1.16/blib/lib
    /home/cpan/pit/rel/conf/perl-5.13.0/.cpanplus/5.13.0/build/UNIVERSAL-can-1.16/blib/arch
    /home/cpan/pit/rel/conf/perl-5.13.0/.cpanplus/5.13.0/build/UNIVERSAL-isa-1.03/blib/lib
    /home/cpan/pit/rel/conf/perl-5.13.0/.cpanplus/5.13.0/build/UNIVERSAL-isa-1.03/blib/arch
    /home/cpan/pit/rel/conf/perl-5.13.0/.cpanplus/5.13.0/build/Test-MockObject-1.09/blib/lib
    /home/cpan/pit/rel/conf/perl-5.13.0/.cpanplus/5.13.0/build/Test-MockObject-1.09/blib/arch
    /home/cpan/pit/rel/conf/perl-5.13.0/.cpanplus/5.13.0/build/Text-FindIndent-0.08/blib/lib
    /home/cpan/pit/rel/conf/perl-5.13.0/.cpanplus/5.13.0/build/Text-FindIndent-0.08/blib/arch
    /home/cpan/pit/rel/conf/perl-5.13.0/.cpanplus/5.13.0/build/Spiffy-0.30/blib/lib
    /home/cpan/pit/rel/conf/perl-5.13.0/.cpanplus/5.13.0/build/Spiffy-0.30/blib/arch
    /home/cpan/pit/rel/conf/perl-5.13.0/.cpanplus/5.13.0/build/Test-Base-0.59/blib/lib
    /home/cpan/pit/rel/conf/perl-5.13.0/.cpanplus/5.13.0/build/Test-Base-0.59/blib/arch
    /home/cpan/pit/rel/conf/perl-5.13.0/.cpanplus/5.13.0/build/ExtUtils-XSpp-0.15/blib/lib
    /home/cpan/pit/rel/conf/perl-5.13.0/.cpanplus/5.13.0/build/ExtUtils-XSpp-0.15/blib/arch
    /home/cpan/pit/rel/perl-5.13.0/lib/site_perl/5.13.0/alpha-linux-thread-multi
    /home/cpan/pit/rel/perl-5.13.0/lib/site_perl/5.13.0
    /home/cpan/pit/rel/perl-5.13.0/lib/5.13.0/alpha-linux-thread-multi
    /home/cpan/pit/rel/perl-5.13.0/lib/5.13.0
    .